{"text_format":"1","workbook":"xlsx","n_sheets":3,"sheets":["Publicização","Seleção","ConnectionMask"],"not_rendered":{"charts":0,"images":2,"macros":1,"external_links":0,"defined_names":66,"comments":0,"pivot_tables":0},"unopened":[],"bounds":{"document_bytes":16777216,"sheet_cells":100000,"rows_first":2000,"rows_last":500,"rows_between":2000,"halvings":0,"cell_chars":16384,"cell_head_chars":4096},"cells_cut":0,"cells_raw":0,"read":"whole","date_system":"1900"}

{"sheet":"Publicização","index":0,"n_rows":27,"n_cols":25,"rows_kept":27,"cut":false,"hidden":false,"merged":[[18,2,18,6],[17,2,17,6],[19,2,19,6],[6,8,6,12],[7,8,7,12],[10,1,10,6],[12,2,12,6],[13,2,13,6],[16,2,16,6],[15,2,15,6],[14,2,14,6],[5,1,5,3],[6,1,6,3],[7,1,8,3],[10,13,10,14],[11,2,11,6],[10,9,10,12],[20,2,20,6],[21,2,21,6],[25,2,25,6],[24,2,24,6],[23,2,23,6],[22,2,22,6]]}
[]
[]
[null,null,null,null,null,null,null,null,null,null,null,null,null,null,null,null,null,null,null,null,null,"Task  First Row",{"$f":"ROW(TaskFirstRow)+1","v":13},-1,"Not Approved"]
[null,null,null,null,null,null,null,null,null,null,null,null,null,null,null,null,null,null,null,null,null,"Task  Last Row",{"$f":"ROW(ProjectLastRow)-1","v":26},1,"L1: Owner"]
[null,null,null,null,null,null,null,null,null,null,null,null,null,null,null,null,null,null,null,null,null,null,null,2,"L2: PMO"]
[null,"GOVERNO DO ESTADO DA BAHIA"]
[null,"(Nome da Secretaria)",null,null,"Processo de Publicização",null,"Secretaria",null,null,null,null,null,null,"Progresso",{"$f":"AVERAGEIFS(P12:P33,A12:A33,\"A\",P12:P33,\"<>N/A\")","v":{"$error":"#DIV/0!"}}]
[null,"(Nome da Entidade Pública vinculada, se for o caso)",null,null,"Planejamento",null,"Responsável",null,null,null,null,null,null,"Atualização"]
[]
[null,null,null,null,null,null,null,null,"H",null,null,null,null,"L","P",null,null,null,null,null,null,null,null,3,"L3: C-Level"]
[null,"Escopo de Atividades",null,null,null,null,null,null,null,"Monitoramento de Prazos"]
["TT","#","Descrição",null,null,null,null,"Duração (dias úteis)","Ator Responsável","Início Previsto","Início Realizado","Final Previsto","Final Realizado","Progresso sobre o Previsto","Progresso sobre o Realizado","Responsável pela Atividade",null,null,null,null,null,"Next Project Row","Quantity  of Analytic Rows","Approved By"]
["S","1.","Manifestação de Interesse e Designação da Comissão de Publicização",null,null,null,null,null,null,null,null,null,null,{"$f":"IFERROR(AVERAGE(INDIRECT(ADDRESS(ROW()+1,COLUMN())&\":\"&ADDRESS(ROW()+INDIRECT(\"X\"&ROW()),COLUMN()))),\"\")","v":""},"",null,"Ì","Add","Ó","Remove",null,{"$f":"IF(INDIRECT(\"A\"&ROW())=\"S\",INDIRECT(\"W\"&ROW()+1),IF(INDIRECT(\"A\"&ROW()+1)=\"s\",ROW()+1,INDIRECT(\"W\"&ROW()+1)))","v":""},{"$f":"IF(INDIRECT(\"A\"&ROW())=\"S\",INDIRECT(\"W\"&ROW())-ROW()-1,\"\")","v":1},{"$f":"IFERROR(IF(#REF!=\"Not Approved\",-1,VALUE(RIGHT(LEFT(#REF!,2),1))),\"\")","v":""}]
["A","1.1","Emissão do Ofício de manifestação de interesse de publicização ",null,null,null,null,null,"Gabinete da Secretaria Interessada",null,null,null,null,0,{"$f":"IFERROR(IF(COUNTIF(INDIRECT(CONCATENATE(\"I\",ROW(),\":O\",ROW())),\"N/A\")=7,\"N/A\",AVERAGE(INDIRECT(CONCATENATE(ADDRESS(ROW(),COLUMN()-7),\":\",ADDRESS(ROW(),COLUMN()-1))))),\"\")","v":0},null,"Ì","Add","Ó","Remove",null,{"$f":"IF(INDIRECT(\"A\"&ROW())=\"S\",INDIRECT(\"W\"&ROW()+1),IF(INDIRECT(\"A\"&ROW()+1)=\"s\",ROW()+1,INDIRECT(\"W\"&ROW()+1)))","v":0},{"$f":"IF(INDIRECT(\"A\"&ROW())=\"S\",INDIRECT(\"W\"&ROW())-ROW()-1,\"\")","v":""},{"$f":"IFERROR(IF(#REF!=\"Not Approved\",-1,VALUE(RIGHT(LEFT(#REF!,2),1))),\"\")","v":""}]
[null,"1.2","Designação da comissão de publicização",null,null,null,null,null,"Gabinete da Secretaria Interessada",null,null,null,null,0,{"$f":"IFERROR(IF(COUNTIF(INDIRECT(CONCATENATE(\"I\",ROW(),\":O\",ROW())),\"N/A\")=7,\"N/A\",AVERAGE(INDIRECT(CONCATENATE(ADDRESS(ROW(),COLUMN()-7),\":\",ADDRESS(ROW(),COLUMN()-1))))),\"\")","v":0},null,"Ì","Add","Ó","Remove"]
["S",2,"Elaboração do Projeto de Publicização com Assessoria da SGI/SAEB",null,null,null,null,null,null,null,null,null,null,{"$f":"IFERROR(AVERAGE(INDIRECT(ADDRESS(ROW()+1,COLUMN())&\":\"&ADDRESS(ROW()+INDIRECT(\"X\"&ROW()),COLUMN()))),\"\")","v":""},"",null,"Ì","Add","Ó","Remove",null,{"$f":"IF(INDIRECT(\"A\"&ROW())=\"S\",INDIRECT(\"W\"&ROW()+1),IF(INDIRECT(\"A\"&ROW()+1)=\"s\",ROW()+1,INDIRECT(\"W\"&ROW()+1)))","v":""},{"$f":"IF(INDIRECT(\"A\"&ROW())=\"S\",INDIRECT(\"W\"&ROW())-ROW()-1,\"\")","v":4},{"$f":"IFERROR(IF(#REF!=\"Not Approved\",-1,VALUE(RIGHT(LEFT(#REF!,2),1))),\"\")","v":""}]
[null,"2.2","Levantamento de informações do serviço a ser publicizado",null,null,null,null,null,"Comissão de Publicização",null,null,null,null,0,{"$f":"IFERROR(IF(COUNTIF(INDIRECT(CONCATENATE(\"I\",ROW(),\":O\",ROW())),\"N/A\")=7,\"N/A\",AVERAGE(INDIRECT(CONCATENATE(ADDRESS(ROW(),COLUMN()-7),\":\",ADDRESS(ROW(),COLUMN()-1))))),\"\")","v":0},null,"Ì","Add","Ó","Remove",null,"","",{"$f":"IFERROR(IF(#REF!=\"Not Approved\",-1,VALUE(RIGHT(LEFT(#REF!,2),1))),\"\")","v":""}]
["A","2.3","Redação do Projeto de Publicização",null,null,null,null,null,"Comissão de Publicização",null,null,null,null,0,0,null,"Ì","Add","Ó","Remove",null,"","",{"$f":"IFERROR(IF(#REF!=\"Not Approved\",-1,VALUE(RIGHT(LEFT(#REF!,2),1))),\"\")","v":""}]
["A","2.4","Realização da Avaliação ex ante",null,null,null,null,null,"UGC",null,null,null,null,0,0,null,"Ì","Add","Ó","Remove",null,"","",{"$f":"IFERROR(IF(#REF!=\"Not Approved\",-1,VALUE(RIGHT(LEFT(#REF!,2),1))),\"\")","v":""}]
["A","2.5","Validação do Projeto",null,null,null,null,null,"Gabinete da Secretaria Interessada",null,null,null,null,0,0,null,"Ì","Add","Ó","Remove",null,21,"",{"$f":"IFERROR(IF(#REF!=\"Not Approved\",-1,VALUE(RIGHT(LEFT(#REF!,2),1))),\"\")","v":""}]
{"$rows_left_out":8}
{"sheet":"Seleção","index":1,"n_rows":30,"n_cols":25,"rows_kept":30,"cut":false,"hidden":false,"merged":[[20,2,20,6],[21,2,21,6],[22,2,22,6],[25,2,25,6],[27,2,27,6],[24,2,24,6],[23,2,23,6],[26,2,26,6],[17,2,17,6],[18,2,18,6],[19,2,19,6],[12,2,12,6],[13,2,13,6],[14,2,14,6],[15,2,15,6],[16,2,16,6],[11,2,11,6],[6,8,6,12],[7,8,7,12],[10,1,10,6],[10,9,10,14],[8,1,9,3],[7,1,7,3],[6,1,6,3]]}
[]
[]
[]
[null,null,null,null,null,null,null,null,null,null,null,null,null,null,null,null,null,null,null,null,null,"Task  First Row",{"$f":"ROW(TaskFirstRow)+1","v":13},-1,"Not Approved"]
[null,null,null,null,null,null,null,null,null,null,null,null,null,null,null,"v.0.50",null,null,null,null,null,"Task  Last Row",{"$f":"ROW(ProjectLastRow)-1","v":29},1,"L1: Owner"]
[null,null,null,null,null,null,null,null,null,null,null,null,null,null,null,null,null,null,null,null,null,null,null,2,"L2: PMO"]
[null,"GOVERNO DO ESTADO DA BAHIA",null,null,"Processo de Seleção",null,"Secretaria",null,null,null,null,null,null,"Progresso",{"$f":"AVERAGEIFS(#REF!,A12:A30,\"A\",#REF!,\"<>N/A\")","v":{"$error":"#REF!"}}]
[null,"(Nome da Secretaria)",null,null,"Planejamento",null,"Responsável",null,null,null,null,null,null,"Atualização"]
[null,"(Nome da Entidade Pública vinculada, se for o caso)"]
[null,null,null,null,null,null,null,null,"H","I",null,null,null,"L","M","Q",null,null,null,null,null,null,null,3,"L3: C-Level"]
[null,"Escopo de Atividades",null,null,null,null,null,null,null,"Monitoramento de Prazos",null,null,null,null,null,"Encerramento"]
["TT","#","Descrição",null,null,null,null,"Duração (dias)","Ator Responsável","Início Previsto","Início Realizado","Final Previsto","Final Realizado","Progresso sobre o Previsto","Progresso sobre o Realizado","Responsável pela atividade",null,null,null,null,null,"Next Project Row","Quantity  of Analytic Rows","Approved By"]
["S","1.","Definição da Comissão de Processo de Seleção",null,null,null,null,null,null,{"$f":"IFERROR(AVERAGE(INDIRECT(ADDRESS(ROW()+1,COLUMN())&\":\"&ADDRESS(ROW()+INDIRECT(\"X\"&ROW()),COLUMN()))),\"\")","v":""},null,null,null,{"$f":"IFERROR(AVERAGE(INDIRECT(ADDRESS(ROW()+1,COLUMN())&\":\"&ADDRESS(ROW()+INDIRECT(\"X\"&ROW()),COLUMN()))),\"\")","v":""},"",null,"Ì","Add","Ó","Remove",null,{"$f":"IF(INDIRECT(\"A\"&ROW())=\"S\",INDIRECT(\"W\"&ROW()+1),IF(INDIRECT(\"A\"&ROW()+1)=\"s\",ROW()+1,INDIRECT(\"W\"&ROW()+1)))","v":""},{"$f":"IF(INDIRECT(\"A\"&ROW())=\"S\",INDIRECT(\"W\"&ROW())-ROW()-1,\"\")","v":1},{"$f":"IFERROR(IF(P13=\"Not Approved\",-1,VALUE(RIGHT(LEFT(P13,2),1))),\"\")","v":""}]
["A","1.1","Titular a comissão e integrantes",null,null,null,null,null,"Gabinete da Secretaria Interessada",null,null,null,null,0,{"$f":"IFERROR(IF(COUNTIF(INDIRECT(CONCATENATE(\"I\",ROW(),\":O\",ROW())),\"N/A\")=7,\"N/A\",AVERAGE(INDIRECT(CONCATENATE(ADDRESS(ROW(),COLUMN()-7),\":\",ADDRESS(ROW(),COLUMN()-1))))),\"\")","v":0},null,"Ì","Add","Ó","Remove",null,{"$f":"IF(INDIRECT(\"A\"&ROW())=\"S\",INDIRECT(\"W\"&ROW()+1),IF(INDIRECT(\"A\"&ROW()+1)=\"s\",ROW()+1,INDIRECT(\"W\"&ROW()+1)))","v":15},{"$f":"IF(INDIRECT(\"A\"&ROW())=\"S\",INDIRECT(\"W\"&ROW())-ROW()-1,\"\")","v":""},{"$f":"IFERROR(IF(P14=\"Not Approved\",-1,VALUE(RIGHT(LEFT(P14,2),1))),\"\")","v":""}]
["S",2,"Desenvolvimento do Edital de Seleção e Minuta de Contrato de Gestão",null,null,null,null,null,null,{"$f":"IFERROR(AVERAGE(INDIRECT(ADDRESS(ROW()+1,COLUMN())&\":\"&ADDRESS(ROW()+INDIRECT(\"X\"&ROW()),COLUMN()))),\"\")","v":""},null,null,null,{"$f":"IFERROR(AVERAGE(INDIRECT(ADDRESS(ROW()+1,COLUMN())&\":\"&ADDRESS(ROW()+INDIRECT(\"X\"&ROW()),COLUMN()))),\"\")","v":""},"",null,"Ì","Add","Ó","Remove",null,{"$f":"IF(INDIRECT(\"A\"&ROW())=\"S\",INDIRECT(\"W\"&ROW()+1),IF(INDIRECT(\"A\"&ROW()+1)=\"s\",ROW()+1,INDIRECT(\"W\"&ROW()+1)))","v":""},{"$f":"IF(INDIRECT(\"A\"&ROW())=\"S\",INDIRECT(\"W\"&ROW())-ROW()-1,\"\")","v":2},{"$f":"IFERROR(IF(P15=\"Not Approved\",-1,VALUE(RIGHT(LEFT(P15,2),1))),\"\")","v":""}]
["A","2.1","Elaborar edital e anexos (incluindo minuta de contrato de gestão etc)",null,null,null,null,null,"Coordenação de Licitação e Área de Negócio",null,null,null,null,0,{"$f":"IFERROR(IF(COUNTIF(INDIRECT(CONCATENATE(\"I\",ROW(),\":O\",ROW())),\"N/A\")=7,\"N/A\",AVERAGE(INDIRECT(CONCATENATE(ADDRESS(ROW(),COLUMN()-7),\":\",ADDRESS(ROW(),COLUMN()-1))))),\"\")","v":0},null,"Ì","Add","Ó","Remove",null,"","",""]
[null,"2.2","Instrução do processo de seleção",null,null,null,null,null,"Comissão Julgadora",null,null,null,null,0,{"$f":"IFERROR(IF(COUNTIF(INDIRECT(CONCATENATE(\"I\",ROW(),\":O\",ROW())),\"N/A\")=7,\"N/A\",AVERAGE(INDIRECT(CONCATENATE(ADDRESS(ROW(),COLUMN()-7),\":\",ADDRESS(ROW(),COLUMN()-1))))),\"\")","v":0},null,"Ì","Add","Ó","Remove",null,18,"",""]
["S","3.","Revisão e Aprovação do Edital e Minuta de Contrato Aprovação do Edital",null,null,null,null,null,null,{"$f":"IFERROR(AVERAGE(INDIRECT(ADDRESS(ROW()+1,COLUMN())&\":\"&ADDRESS(ROW()+INDIRECT(\"X\"&ROW()),COLUMN()))),\"\")","v":""},null,null,null,0,{"$f":"IFERROR(IF(COUNTIF(INDIRECT(CONCATENATE(\"I\",ROW(),\":O\",ROW())),\"N/A\")=7,\"N/A\",AVERAGE(INDIRECT(CONCATENATE(ADDRESS(ROW(),COLUMN()-7),\":\",ADDRESS(ROW(),COLUMN()-1))))),\"\")","v":0},null,"Ì","Add","Ó","Remove",null,"",6,""]
["A","3.1","Emitir Parecer Técnico sobre os termos do contrato de gestão, indicadores e metas",null,null,null,null,null,"SGI/SAEB",null,null,null,null,0,{"$f":"IFERROR(IF(COUNTIF(INDIRECT(CONCATENATE(\"I\",ROW(),\":O\",ROW())),\"N/A\")=7,\"N/A\",AVERAGE(INDIRECT(CONCATENATE(ADDRESS(ROW(),COLUMN()-7),\":\",ADDRESS(ROW(),COLUMN()-1))))),\"\")","v":0},null,"Ì","Add","Ó","Remove",null,"","",""]
["A","3.2","Emitir Parecer Jurídico sobre edital e anexos",null,null,null,null,null,"PGE",null,null,null,null,0,0,null,"Ì","Add","Ó","Remove",null,"","",""]
{"$rows_left_out":11}
{"sheet":"ConnectionMask","index":2,"n_rows":203,"n_cols":16,"rows_kept":203,"cut":false,"hidden":true,"merged":[]}
["Total Rows",null,"Total \"A\" Rows","Consolidated Start","Consolidated End",null,"Start Row","End Row"]
[{"$f":"COUNTIF($D$6:$D$203,\"S\")+COUNTIF($D$6:$D$203,\"A\")","v":12},null,{"$f":"H2-G2","v":13},{"$f":"ROW(E6)","v":6},{"$f":"D2+C2","v":19},null,{"$f":"ROW(INDIRECT(\"'\"&INDEX(MID(SheetNames,FIND(\"]\",SheetNames)+1,255),ROWS(A$4:$A$4))&\"'!\"&\"TaskFirstRow\"))+1","v":13},{"$f":"ROW(INDIRECT(\"'\"&INDEX(MID(SheetNames,FIND(\"]\",SheetNames)+1,255),ROWS(A$4:$A$4))&\"'!\"&\"ProjectLastRow\"))-1","v":26}]
[]
[null,null,null,"A","B","C","H","I","J","K","L","M","N","O","P","Q"]
["Row Number","Row ID","Workstream","Task Type","WBS #","Description","Due Date","VAC \n(To Be)","EPC \n(To Be)","FAD \n(To Be)","Screen Capturing","Template \n(As Is)","System GAPs","Process GAPs","Overall Progress","Approved By"]
[{"$f":"ROW(INDIRECT(\"'\"&INDEX(MID(SheetNames,FIND(\"]\",SheetNames)+1,255),ROWS(A$4:$A$4))&\"'!\"&\"TaskFirstRow\"))+1","v":13},{"$f":"IF(D6=\"\",\"\",C6&\"_\"&E6)","v":"Publicização_1."},{"$f":"INDEX(MID(SheetNames,FIND(\"]\",SheetNames)+1,255),ROWS(A$4:$A$4))","v":"Publicização"},{"$f":"IF(OR(ISBLANK(INDIRECT(\"'\"&$C6&\"'!\"&D$4&$A6)),ISERROR(INDIRECT(\"'\"&$C6&\"'!\"&D$4&$A6))),\"\",INDIRECT(\"'\"&$C6&\"'!\"&D$4&$A6))","v":"S"},{"$f":"IF(OR(ISBLANK(INDIRECT(\"'\"&$C6&\"'!\"&E$4&$A6)),ISERROR(INDIRECT(\"'\"&$C6&\"'!\"&E$4&$A6))),\"\",INDIRECT(\"'\"&$C6&\"'!\"&E$4&$A6))","v":"1."},"Manifestação de Interesse e Designação da Comissão de Publicização","","","","","","","","","","Ì"]
[{"$f":"IF(INDIRECT(ADDRESS(ROW()-1,COLUMN()))+1>ROW(INDIRECT(\"'\"&INDEX(MID(SheetNames,FIND(\"]\",SheetNames)+1,255),ROWS(A$4:$A$4))&\"'!\"&\"ProjectLastRow\"))-1,\"\",IF(ISERROR(VLOOKUP(ROW(),$T$6:$W$25,4,0)),A6+1,VLOOKUP(ROW(),$T$6:$W$25,4,0)))","v":14},{"$f":"IF(D7=\"\",\"\",C7&\"_\"&E7)","v":"Publicização_1.1"},{"$f":"INDEX(MID(SheetNames,FIND(\"]\",SheetNames)+1,255),ROWS(A$4:$A$4))","v":"Publicização"},{"$f":"IF(OR(ISBLANK(INDIRECT(\"'\"&$C7&\"'!\"&D$4&$A7)),ISERROR(INDIRECT(\"'\"&$C7&\"'!\"&D$4&$A7))),\"\",INDIRECT(\"'\"&$C7&\"'!\"&D$4&$A7))","v":"A"},"1.1","Emissão do Ofício de manifestação de interesse de publicização ","","Gabinete da Secretaria Interessada","","","","",0,"","","Ì"]
[{"$f":"IF(INDIRECT(ADDRESS(ROW()-1,COLUMN()))+1>ROW(INDIRECT(\"'\"&INDEX(MID(SheetNames,FIND(\"]\",SheetNames)+1,255),ROWS(A$4:$A$4))&\"'!\"&\"ProjectLastRow\"))-1,\"\",IF(ISERROR(VLOOKUP(ROW(),$T$6:$W$25,4,0)),A7+1,VLOOKUP(ROW(),$T$6:$W$25,4,0)))","v":15},"",{"$f":"INDEX(MID(SheetNames,FIND(\"]\",SheetNames)+1,255),ROWS(A$4:$A$4))","v":"Publicização"},"","1.2","Designação da comissão de publicização","","Gabinete da Secretaria Interessada","","","","",0,"","","Ì"]
[{"$f":"IF(INDIRECT(ADDRESS(ROW()-1,COLUMN()))+1>ROW(INDIRECT(\"'\"&INDEX(MID(SheetNames,FIND(\"]\",SheetNames)+1,255),ROWS(A$4:$A$4))&\"'!\"&\"ProjectLastRow\"))-1,\"\",IF(ISERROR(VLOOKUP(ROW(),$T$6:$W$25,4,0)),A8+1,VLOOKUP(ROW(),$T$6:$W$25,4,0)))","v":16},"Publicização_2",{"$f":"INDEX(MID(SheetNames,FIND(\"]\",SheetNames)+1,255),ROWS(A$4:$A$4))","v":"Publicização"},"S",2,"Elaboração do Projeto de Publicização com Assessoria da SGI/SAEB","","","","","","","","","","Ì"]
[{"$f":"IF(INDIRECT(ADDRESS(ROW()-1,COLUMN()))+1>ROW(INDIRECT(\"'\"&INDEX(MID(SheetNames,FIND(\"]\",SheetNames)+1,255),ROWS(A$4:$A$4))&\"'!\"&\"ProjectLastRow\"))-1,\"\",IF(ISERROR(VLOOKUP(ROW(),$T$6:$W$25,4,0)),A9+1,VLOOKUP(ROW(),$T$6:$W$25,4,0)))","v":17},"",{"$f":"INDEX(MID(SheetNames,FIND(\"]\",SheetNames)+1,255),ROWS(A$4:$A$4))","v":"Publicização"},"","2.2","Levantamento de informações do serviço a ser publicizado","","Comissão de Publicização","","","","",0,"","","Ì"]
[{"$f":"IF(INDIRECT(ADDRESS(ROW()-1,COLUMN()))+1>ROW(INDIRECT(\"'\"&INDEX(MID(SheetNames,FIND(\"]\",SheetNames)+1,255),ROWS(A$4:$A$4))&\"'!\"&\"ProjectLastRow\"))-1,\"\",IF(ISERROR(VLOOKUP(ROW(),$T$6:$W$25,4,0)),A10+1,VLOOKUP(ROW(),$T$6:$W$25,4,0)))","v":18},"Publicização_2.3",{"$f":"INDEX(MID(SheetNames,FIND(\"]\",SheetNames)+1,255),ROWS(A$4:$A$4))","v":"Publicização"},"A","2.3","Redação do Projeto de Publicização","","Comissão de Publicização","","","","",0,"","","Ì"]
[{"$f":"IF(INDIRECT(ADDRESS(ROW()-1,COLUMN()))+1>ROW(INDIRECT(\"'\"&INDEX(MID(SheetNames,FIND(\"]\",SheetNames)+1,255),ROWS(A$4:$A$4))&\"'!\"&\"ProjectLastRow\"))-1,\"\",IF(ISERROR(VLOOKUP(ROW(),$T$6:$W$25,4,0)),A11+1,VLOOKUP(ROW(),$T$6:$W$25,4,0)))","v":19},"Publicização_2.4",{"$f":"INDEX(MID(SheetNames,FIND(\"]\",SheetNames)+1,255),ROWS(A$4:$A$4))","v":"Publicização"},"A","2.4","Realização da Avaliação ex ante","","UGC","","","","",0,"","","Ì"]
[{"$f":"IF(INDIRECT(ADDRESS(ROW()-1,COLUMN()))+1>ROW(INDIRECT(\"'\"&INDEX(MID(SheetNames,FIND(\"]\",SheetNames)+1,255),ROWS(A$4:$A$4))&\"'!\"&\"ProjectLastRow\"))-1,\"\",IF(ISERROR(VLOOKUP(ROW(),$T$6:$W$25,4,0)),A12+1,VLOOKUP(ROW(),$T$6:$W$25,4,0)))","v":20},"Publicização_2.5",{"$f":"INDEX(MID(SheetNames,FIND(\"]\",SheetNames)+1,255),ROWS(A$4:$A$4))","v":"Publicização"},"A","2.5","Validação do Projeto","","Gabinete da Secretaria Interessada","","","","",0,"","","Ì"]
[{"$f":"IF(INDIRECT(ADDRESS(ROW()-1,COLUMN()))+1>ROW(INDIRECT(\"'\"&INDEX(MID(SheetNames,FIND(\"]\",SheetNames)+1,255),ROWS(A$4:$A$4))&\"'!\"&\"ProjectLastRow\"))-1,\"\",IF(ISERROR(VLOOKUP(ROW(),$T$6:$W$25,4,0)),A13+1,VLOOKUP(ROW(),$T$6:$W$25,4,0)))","v":21},"Publicização_3.",{"$f":"INDEX(MID(SheetNames,FIND(\"]\",SheetNames)+1,255),ROWS(A$4:$A$4))","v":"Publicização"},"S","3.","Publicização","","","","","","","","","","Ì"]
[{"$f":"IF(INDIRECT(ADDRESS(ROW()-1,COLUMN()))+1>ROW(INDIRECT(\"'\"&INDEX(MID(SheetNames,FIND(\"]\",SheetNames)+1,255),ROWS(A$4:$A$4))&\"'!\"&\"ProjectLastRow\"))-1,\"\",IF(ISERROR(VLOOKUP(ROW(),$T$6:$W$25,4,0)),A14+1,VLOOKUP(ROW(),$T$6:$W$25,4,0)))","v":22},"Publicização_3.1",{"$f":"INDEX(MID(SheetNames,FIND(\"]\",SheetNames)+1,255),ROWS(A$4:$A$4))","v":"Publicização"},"A","3.1","Emissão do Parecer de Conveniência e Oportunidade","","Gabinete da Secretaria Interessada","","","","",0,"","","Ì"]
[{"$f":"IF(INDIRECT(ADDRESS(ROW()-1,COLUMN()))+1>ROW(INDIRECT(\"'\"&INDEX(MID(SheetNames,FIND(\"]\",SheetNames)+1,255),ROWS(A$4:$A$4))&\"'!\"&\"ProjectLastRow\"))-1,\"\",IF(ISERROR(VLOOKUP(ROW(),$T$6:$W$25,4,0)),A15+1,VLOOKUP(ROW(),$T$6:$W$25,4,0)))","v":23},"Publicização_3.2",{"$f":"INDEX(MID(SheetNames,FIND(\"]\",SheetNames)+1,255),ROWS(A$4:$A$4))","v":"Publicização"},"A","3.2","Emissão de parecer técnico sobre o Projeto de Publicização","","SGI/SAEB","","","","",0,"","","Ì"]
[{"$f":"IF(INDIRECT(ADDRESS(ROW()-1,COLUMN()))+1>ROW(INDIRECT(\"'\"&INDEX(MID(SheetNames,FIND(\"]\",SheetNames)+1,255),ROWS(A$4:$A$4))&\"'!\"&\"ProjectLastRow\"))-1,\"\",IF(ISERROR(VLOOKUP(ROW(),$T$6:$W$25,4,0)),A16+1,VLOOKUP(ROW(),$T$6:$W$25,4,0)))","v":24},"Publicização_3.3",{"$f":"INDEX(MID(SheetNames,FIND(\"]\",SheetNames)+1,255),ROWS(A$4:$A$4))","v":"Publicização"},"A","3.3","Emissão e publicação no Diário Oficial do Estado de resolução sobre o pedido de publicização ","","CONGEOS","","","","",0,"","","Ì"]
[{"$f":"IF(INDIRECT(ADDRESS(ROW()-1,COLUMN()))+1>ROW(INDIRECT(\"'\"&INDEX(MID(SheetNames,FIND(\"]\",SheetNames)+1,255),ROWS(A$4:$A$4))&\"'!\"&\"ProjectLastRow\"))-1,\"\",IF(ISERROR(VLOOKUP(ROW(),$T$6:$W$25,4,0)),A17+1,VLOOKUP(ROW(),$T$6:$W$25,4,0)))","v":25},"Publicização_3.4",{"$f":"INDEX(MID(SheetNames,FIND(\"]\",SheetNames)+1,255),ROWS(A$4:$A$4))","v":"Publicização"},"A","3.4","Publicação, no Diário Oficial do Estado, do autorizo da publicização pelo Governador ","","Casa Civil","","","","",0,"","","Ì"]
[{"$f":"IF(INDIRECT(ADDRESS(ROW()-1,COLUMN()))+1>ROW(INDIRECT(\"'\"&INDEX(MID(SheetNames,FIND(\"]\",SheetNames)+1,255),ROWS(A$4:$A$4))&\"'!\"&\"ProjectLastRow\"))-1,\"\",IF(ISERROR(VLOOKUP(ROW(),$T$6:$W$25,4,0)),A18+1,VLOOKUP(ROW(),$T$6:$W$25,4,0)))","v":26},"Publicização_3.5",{"$f":"INDEX(MID(SheetNames,FIND(\"]\",SheetNames)+1,255),ROWS(A$4:$A$4))","v":"Publicização"},"A","3.5","Publicação, no Diário Oficial do Estado,  da portaria de publicização ","","Gabinete da Secretaria Interessada","","","","",0,"","","Ì"]
[{"$f":"IF(INDIRECT(ADDRESS(ROW()-1,COLUMN()))+1>ROW(INDIRECT(\"'\"&INDEX(MID(SheetNames,FIND(\"]\",SheetNames)+1,255),ROWS(A$4:$A$4))&\"'!\"&\"ProjectLastRow\"))-1,\"\",IF(ISERROR(VLOOKUP(ROW(),$T$6:$W$25,4,0)),A19+1,VLOOKUP(ROW(),$T$6:$W$25,4,0)))","v":""},"",{"$f":"INDEX(MID(SheetNames,FIND(\"]\",SheetNames)+1,255),ROWS(A$4:$A$4))","v":"Publicização"},"","","","","","","","","","","","",""]
{"$rows_left_out":183}