{"text_format":"1","workbook":"xlsx","n_sheets":3,"sheets":["Publicização","Seleção","ConnectionMask"],"not_rendered":{"charts":0,"images":2,"macros":1,"external_links":0,"defined_names":66,"comments":0,"pivot_tables":0},"unopened":[],"bounds":{"document_bytes":16777216,"sheet_cells":100000,"rows_first":2000,"rows_last":500,"rows_between":2000,"halvings":0,"cell_chars":16384,"cell_head_chars":4096},"cells_cut":0,"cells_raw":0,"read":"whole","date_system":"1900"}

{"sheet":"Publicização","index":0,"n_rows":27,"n_cols":25,"rows_kept":27,"cut":false,"hidden":false,"merged":[[18,2,18,6],[17,2,17,6],[19,2,19,6],[6,8,6,12],[7,8,7,12],[10,1,10,6],[12,2,12,6],[13,2,13,6],[16,2,16,6],[15,2,15,6],[14,2,14,6],[5,1,5,3],[6,1,6,3],[7,1,8,3],[10,13,10,14],[11,2,11,6],[10,9,10,12],[20,2,20,6],[21,2,21,6],[25,2,25,6],[24,2,24,6],[23,2,23,6],[22,2,22,6]]}
[]
[]
[null,null,null,null,null,null,null,null,null,null,null,null,null,null,null,null,null,null,null,null,null,"Task  First Row",{"$f":"ROW(TaskFirstRow)+1","v":13},-1,"Not Approved"]
[null,null,null,null,null,null,null,null,null,null,null,null,null,null,null,null,null,null,null,null,null,"Task  Last Row",{"$f":"ROW(ProjectLastRow)-1","v":26},1,"L1: Owner"]
[null,null,null,null,null,null,null,null,null,null,null,null,null,null,null,null,null,null,null,null,null,null,null,2,"L2: PMO"]
[null,"GOVERNO DO ESTADO DA BAHIA"]
[null,"(Nome da Secretaria)",null,null,"Processo de Publicização",null,"Secretaria",null,null,null,null,null,null,"Progresso",{"$f":"AVERAGEIFS(P12:P33,A12:A33,\"A\",P12:P33,\"<>N/A\")","v":{"$error":"#DIV/0!"}}]
[null,"(Nome da Entidade Pública vinculada, se for o caso)",null,null,"Planejamento",null,"Responsável",null,null,null,null,null,null,"Atualização"]
[]
[null,null,null,null,null,null,null,null,"H",null,null,null,null,"L","P",null,null,null,null,null,null,null,null,3,"L3: C-Level"]
[null,"Escopo de Atividades",null,null,null,null,null,null,null,"Monitoramento de Prazos"]
["TT","#","Descrição",null,null,null,null,"Duração (dias úteis)","Ator Responsável","Início Previsto","Início Realizado","Final Previsto","Final Realizado","Progresso sobre o Previsto","Progresso sobre o Realizado","Responsável pela Atividade",null,null,null,null,null,"Next Project Row","Quantity  of Analytic Rows","Approved By"]
["S","1.","Manifestação de Interesse e Designação da Comissão de Publicização",null,null,null,null,null,null,null,null,null,null,{"$f":"IFERROR(AVERAGE(INDIRECT(ADDRESS(ROW()+1,COLUMN())&\":\"&ADDRESS(ROW()+INDIRECT(\"X\"&ROW()),COLUMN()))),\"\")","v":""},"",null,"Ì","Add","Ó","Remove",null,{"$f":"IF(INDIRECT(\"A\"&ROW())=\"S\",INDIRECT(\"W\"&ROW()+1),IF(INDIRECT(\"A\"&ROW()+1)=\"s\",ROW()+1,INDIRECT(\"W\"&ROW()+1)))","v":""},{"$f":"IF(INDIRECT(\"A\"&ROW())=\"S\",INDIRECT(\"W\"&ROW())-ROW()-1,\"\")","v":1},{"$f":"IFERROR(IF(#REF!=\"Not Approved\",-1,VALUE(RIGHT(LEFT(#REF!,2),1))),\"\")","v":""}]
["A","1.1","Emissão do Ofício de manifestação de interesse de publicização ",null,null,null,null,null,"Gabinete da Secretaria Interessada",null,null,null,null,0,{"$f":"IFERROR(IF(COUNTIF(INDIRECT(CONCATENATE(\"I\",ROW(),\":O\",ROW())),\"N/A\")=7,\"N/A\",AVERAGE(INDIRECT(CONCATENATE(ADDRESS(ROW(),COLUMN()-7),\":\",ADDRESS(ROW(),COLUMN()-1))))),\"\")","v":0},null,"Ì","Add","Ó","Remove",null,{"$f":"IF(INDIRECT(\"A\"&ROW())=\"S\",INDIRECT(\"W\"&ROW()+1),IF(INDIRECT(\"A\"&ROW()+1)=\"s\",ROW()+1,INDIRECT(\"W\"&ROW()+1)))","v":0},{"$f":"IF(INDIRECT(\"A\"&ROW())=\"S\",INDIRECT(\"W\"&ROW())-ROW()-1,\"\")","v":""},{"$f":"IFERROR(IF(#REF!=\"Not Approved\",-1,VALUE(RIGHT(LEFT(#REF!,2),1))),\"\")","v":""}]
[null,"1.2","Designação da comissão de publicização",null,null,null,null,null,"Gabinete da Secretaria Interessada",null,null,null,null,0,{"$f":"IFERROR(IF(COUNTIF(INDIRECT(CONCATENATE(\"I\",ROW(),\":O\",ROW())),\"N/A\")=7,\"N/A\",AVERAGE(INDIRECT(CONCATENATE(ADDRESS(ROW(),COLUMN()-7),\":\",ADDRESS(ROW(),COLUMN()-1))))),\"\")","v":0},null,"Ì","Add","Ó","Remove"]
["S",2,"Elaboração do Projeto de Publicização com Assessoria da SGI/SAEB",null,null,null,null,null,null,null,null,null,null,{"$f":"IFERROR(AVERAGE(INDIRECT(ADDRESS(ROW()+1,COLUMN())&\":\"&ADDRESS(ROW()+INDIRECT(\"X\"&ROW()),COLUMN()))),\"\")","v":""},"",null,"Ì","Add","Ó","Remove",null,{"$f":"IF(INDIRECT(\"A\"&ROW())=\"S\",INDIRECT(\"W\"&ROW()+1),IF(INDIRECT(\"A\"&ROW()+1)=\"s\",ROW()+1,INDIRECT(\"W\"&ROW()+1)))","v":""},{"$f":"IF(INDIRECT(\"A\"&ROW())=\"S\",INDIRECT(\"W\"&ROW())-ROW()-1,\"\")","v":4},{"$f":"IFERROR(IF(#REF!=\"Not Approved\",-1,VALUE(RIGHT(LEFT(#REF!,2),1))),\"\")","v":""}]
[null,"2.2","Levantamento de informações do serviço a ser publicizado",null,null,null,null,null,"Comissão de Publicização",null,null,null,null,0,{"$f":"IFERROR(IF(COUNTIF(INDIRECT(CONCATENATE(\"I\",ROW(),\":O\",ROW())),\"N/A\")=7,\"N/A\",AVERAGE(INDIRECT(CONCATENATE(ADDRESS(ROW(),COLUMN()-7),\":\",ADDRESS(ROW(),COLUMN()-1))))),\"\")","v":0},null,"Ì","Add","Ó","Remove",null,"","",{"$f":"IFERROR(IF(#REF!=\"Not Approved\",-1,VALUE(RIGHT(LEFT(#REF!,2),1))),\"\")","v":""}]
["A","2.3","Redação do Projeto de Publicização",null,null,null,null,null,"Comissão de Publicização",null,null,null,null,0,0,null,"Ì","Add","Ó","Remove",null,"","",{"$f":"IFERROR(IF(#REF!=\"Not Approved\",-1,VALUE(RIGHT(LEFT(#REF!,2),1))),\"\")","v":""}]
["A","2.4","Realização da Avaliação ex ante",null,null,null,null,null,"UGC",null,null,null,null,0,0,null,"Ì","Add","Ó","Remove",null,"","",{"$f":"IFERROR(IF(#REF!=\"Not Approved\",-1,VALUE(RIGHT(LEFT(#REF!,2),1))),\"\")","v":""}]
["A","2.5","Validação do Projeto",null,null,null,null,null,"Gabinete da Secretaria Interessada",null,null,null,null,0,0,null,"Ì","Add","Ó","Remove",null,21,"",{"$f":"IFERROR(IF(#REF!=\"Not Approved\",-1,VALUE(RIGHT(LEFT(#REF!,2),1))),\"\")","v":""}]
["S","3.","Publicização",null,null,null,null,null,null,null,null,null,null,{"$f":"IFERROR(AVERAGE(INDIRECT(ADDRESS(ROW()+1,COLUMN())&\":\"&ADDRESS(ROW()+INDIRECT(\"X\"&ROW()),COLUMN()))),\"\")","v":""},"",null,"Ì","Add","Ó","Remove",null,{"$f":"IF(INDIRECT(\"A\"&ROW())=\"S\",INDIRECT(\"W\"&ROW()+1),IF(INDIRECT(\"A\"&ROW()+1)=\"s\",ROW()+1,INDIRECT(\"W\"&ROW()+1)))","v":""},{"$f":"IF(INDIRECT(\"A\"&ROW())=\"S\",INDIRECT(\"W\"&ROW())-ROW()-1,\"\")","v":5},{"$f":"IFERROR(IF(#REF!=\"Not Approved\",-1,VALUE(RIGHT(LEFT(#REF!,2),1))),\"\")","v":""}]
["A","3.1","Emissão do Parecer de Conveniência e Oportunidade",null,null,null,null,null,"Gabinete da Secretaria Interessada",null,null,null,null,0,0,null,"Ì","Add","Ó","Remove",null,"","",{"$f":"IFERROR(IF(#REF!=\"Not Approved\",-1,VALUE(RIGHT(LEFT(#REF!,2),1))),\"\")","v":""}]
["A","3.2","Emissão de parecer técnico sobre o Projeto de Publicização",null,null,null,null,null,"SGI/SAEB",null,null,null,null,0,0,null,"Ì","Add","Ó","Remove",null,"","",{"$f":"IFERROR(IF(#REF!=\"Not Approved\",-1,VALUE(RIGHT(LEFT(#REF!,2),1))),\"\")","v":""}]
["A","3.3","Emissão e publicação no Diário Oficial do Estado de resolução sobre o pedido de publicização ",null,null,null,null,null,"CONGEOS",null,null,null,null,0,0,null,"Ì","Add","Ó","Remove",null,"","",{"$f":"IFERROR(IF(#REF!=\"Not Approved\",-1,VALUE(RIGHT(LEFT(#REF!,2),1))),\"\")","v":""}]
["A","3.4","Publicação, no Diário Oficial do Estado, do autorizo da publicização pelo Governador ",null,null,null,null,null,"Casa Civil",null,null,null,null,0,0,null,"Ì","Add","Ó","Remove",null,"","",{"$f":"IFERROR(IF(#REF!=\"Not Approved\",-1,VALUE(RIGHT(LEFT(#REF!,2),1))),\"\")","v":""}]
["A","3.5","Publicação, no Diário Oficial do Estado,  da portaria de publicização ",null,null,null,null,null,"Gabinete da Secretaria Interessada",null,null,null,null,0,0,null,"Ì","Add","Ó","Remove",null,"","",{"$f":"IFERROR(IF(#REF!=\"Not Approved\",-1,VALUE(RIGHT(LEFT(#REF!,2),1))),\"\")","v":""}]
[null,"Ì","Add Level 3 Process",null,null,null,null,null,null,null,null,null,null,null,null,null,null,null,null,null,null,{"$f":"ROW()","v":27},{"$f":"IF(INDIRECT(\"A\"&ROW())=\"S\",INDIRECT(\"W\"&ROW())-ROW()-1,\"\")","v":""},{"$f":"IFERROR(IF(#REF!=\"Not Approved\",-1,VALUE(RIGHT(LEFT(#REF!,2),1))),\"\")","v":""}]

{"sheet":"Seleção","index":1,"n_rows":30,"n_cols":25,"rows_kept":30,"cut":false,"hidden":false,"merged":[[20,2,20,6],[21,2,21,6],[22,2,22,6],[25,2,25,6],[27,2,27,6],[24,2,24,6],[23,2,23,6],[26,2,26,6],[17,2,17,6],[18,2,18,6],[19,2,19,6],[12,2,12,6],[13,2,13,6],[14,2,14,6],[15,2,15,6],[16,2,16,6],[11,2,11,6],[6,8,6,12],[7,8,7,12],[10,1,10,6],[10,9,10,14],[8,1,9,3],[7,1,7,3],[6,1,6,3]]}
[]
[]
[]
[null,null,null,null,null,null,null,null,null,null,null,null,null,null,null,null,null,null,null,null,null,"Task  First Row",{"$f":"ROW(TaskFirstRow)+1","v":13},-1,"Not Approved"]
[null,null,null,null,null,null,null,null,null,null,null,null,null,null,null,"v.0.50",null,null,null,null,null,"Task  Last Row",{"$f":"ROW(ProjectLastRow)-1","v":29},1,"L1: Owner"]
[null,null,null,null,null,null,null,null,null,null,null,null,null,null,null,null,null,null,null,null,null,null,null,2,"L2: PMO"]
[null,"GOVERNO DO ESTADO DA BAHIA",null,null,"Processo de Seleção",null,"Secretaria",null,null,null,null,null,null,"Progresso",{"$f":"AVERAGEIFS(#REF!,A12:A30,\"A\",#REF!,\"<>N/A\")","v":{"$error":"#REF!"}}]
[null,"(Nome da Secretaria)",null,null,"Planejamento",null,"Responsável",null,null,null,null,null,null,"Atualização"]
[null,"(Nome da Entidade Pública vinculada, se for o caso)"]
[null,null,null,null,null,null,null,null,"H","I",null,null,null,"L","M","Q",null,null,null,null,null,null,null,3,"L3: C-Level"]
[null,"Escopo de Atividades",null,null,null,null,null,null,null,"Monitoramento de Prazos",null,null,null,null,null,"Encerramento"]
["TT","#","Descrição",null,null,null,null,"Duração (dias)","Ator Responsável","Início Previsto","Início Realizado","Final Previsto","Final Realizado","Progresso sobre o Previsto","Progresso sobre o Realizado","Responsável pela atividade",null,null,null,null,null,"Next Project Row","Quantity  of Analytic Rows","Approved By"]
["S","1.","Definição da Comissão de Processo de Seleção",null,null,null,null,null,null,{"$f":"IFERROR(AVERAGE(INDIRECT(ADDRESS(ROW()+1,COLUMN())&\":\"&ADDRESS(ROW()+INDIRECT(\"X\"&ROW()),COLUMN()))),\"\")","v":""},null,null,null,{"$f":"IFERROR(AVERAGE(INDIRECT(ADDRESS(ROW()+1,COLUMN())&\":\"&ADDRESS(ROW()+INDIRECT(\"X\"&ROW()),COLUMN()))),\"\")","v":""},"",null,"Ì","Add","Ó","Remove",null,{"$f":"IF(INDIRECT(\"A\"&ROW())=\"S\",INDIRECT(\"W\"&ROW()+1),IF(INDIRECT(\"A\"&ROW()+1)=\"s\",ROW()+1,INDIRECT(\"W\"&ROW()+1)))","v":""},{"$f":"IF(INDIRECT(\"A\"&ROW())=\"S\",INDIRECT(\"W\"&ROW())-ROW()-1,\"\")","v":1},{"$f":"IFERROR(IF(P13=\"Not Approved\",-1,VALUE(RIGHT(LEFT(P13,2),1))),\"\")","v":""}]
["A","1.1","Titular a comissão e integrantes",null,null,null,null,null,"Gabinete da Secretaria Interessada",null,null,null,null,0,{"$f":"IFERROR(IF(COUNTIF(INDIRECT(CONCATENATE(\"I\",ROW(),\":O\",ROW())),\"N/A\")=7,\"N/A\",AVERAGE(INDIRECT(CONCATENATE(ADDRESS(ROW(),COLUMN()-7),\":\",ADDRESS(ROW(),COLUMN()-1))))),\"\")","v":0},null,"Ì","Add","Ó","Remove",null,{"$f":"IF(INDIRECT(\"A\"&ROW())=\"S\",INDIRECT(\"W\"&ROW()+1),IF(INDIRECT(\"A\"&ROW()+1)=\"s\",ROW()+1,INDIRECT(\"W\"&ROW()+1)))","v":15},{"$f":"IF(INDIRECT(\"A\"&ROW())=\"S\",INDIRECT(\"W\"&ROW())-ROW()-1,\"\")","v":""},{"$f":"IFERROR(IF(P14=\"Not Approved\",-1,VALUE(RIGHT(LEFT(P14,2),1))),\"\")","v":""}]
["S",2,"Desenvolvimento do Edital de Seleção e Minuta de Contrato de Gestão",null,null,null,null,null,null,{"$f":"IFERROR(AVERAGE(INDIRECT(ADDRESS(ROW()+1,COLUMN())&\":\"&ADDRESS(ROW()+INDIRECT(\"X\"&ROW()),COLUMN()))),\"\")","v":""},null,null,null,{"$f":"IFERROR(AVERAGE(INDIRECT(ADDRESS(ROW()+1,COLUMN())&\":\"&ADDRESS(ROW()+INDIRECT(\"X\"&ROW()),COLUMN()))),\"\")","v":""},"",null,"Ì","Add","Ó","Remove",null,{"$f":"IF(INDIRECT(\"A\"&ROW())=\"S\",INDIRECT(\"W\"&ROW()+1),IF(INDIRECT(\"A\"&ROW()+1)=\"s\",ROW()+1,INDIRECT(\"W\"&ROW()+1)))","v":""},{"$f":"IF(INDIRECT(\"A\"&ROW())=\"S\",INDIRECT(\"W\"&ROW())-ROW()-1,\"\")","v":2},{"$f":"IFERROR(IF(P15=\"Not Approved\",-1,VALUE(RIGHT(LEFT(P15,2),1))),\"\")","v":""}]
["A","2.1","Elaborar edital e anexos (incluindo minuta de contrato de gestão etc)",null,null,null,null,null,"Coordenação de Licitação e Área de Negócio",null,null,null,null,0,{"$f":"IFERROR(IF(COUNTIF(INDIRECT(CONCATENATE(\"I\",ROW(),\":O\",ROW())),\"N/A\")=7,\"N/A\",AVERAGE(INDIRECT(CONCATENATE(ADDRESS(ROW(),COLUMN()-7),\":\",ADDRESS(ROW(),COLUMN()-1))))),\"\")","v":0},null,"Ì","Add","Ó","Remove",null,"","",""]
[null,"2.2","Instrução do processo de seleção",null,null,null,null,null,"Comissão Julgadora",null,null,null,null,0,{"$f":"IFERROR(IF(COUNTIF(INDIRECT(CONCATENATE(\"I\",ROW(),\":O\",ROW())),\"N/A\")=7,\"N/A\",AVERAGE(INDIRECT(CONCATENATE(ADDRESS(ROW(),COLUMN()-7),\":\",ADDRESS(ROW(),COLUMN()-1))))),\"\")","v":0},null,"Ì","Add","Ó","Remove",null,18,"",""]
["S","3.","Revisão e Aprovação do Edital e Minuta de Contrato Aprovação do Edital",null,null,null,null,null,null,{"$f":"IFERROR(AVERAGE(INDIRECT(ADDRESS(ROW()+1,COLUMN())&\":\"&ADDRESS(ROW()+INDIRECT(\"X\"&ROW()),COLUMN()))),\"\")","v":""},null,null,null,0,{"$f":"IFERROR(IF(COUNTIF(INDIRECT(CONCATENATE(\"I\",ROW(),\":O\",ROW())),\"N/A\")=7,\"N/A\",AVERAGE(INDIRECT(CONCATENATE(ADDRESS(ROW(),COLUMN()-7),\":\",ADDRESS(ROW(),COLUMN()-1))))),\"\")","v":0},null,"Ì","Add","Ó","Remove",null,"",6,""]
["A","3.1","Emitir Parecer Técnico sobre os termos do contrato de gestão, indicadores e metas",null,null,null,null,null,"SGI/SAEB",null,null,null,null,0,{"$f":"IFERROR(IF(COUNTIF(INDIRECT(CONCATENATE(\"I\",ROW(),\":O\",ROW())),\"N/A\")=7,\"N/A\",AVERAGE(INDIRECT(CONCATENATE(ADDRESS(ROW(),COLUMN()-7),\":\",ADDRESS(ROW(),COLUMN()-1))))),\"\")","v":0},null,"Ì","Add","Ó","Remove",null,"","",""]
["A","3.2","Emitir Parecer Jurídico sobre edital e anexos",null,null,null,null,null,"PGE",null,null,null,null,0,0,null,"Ì","Add","Ó","Remove",null,"","",""]
["A","3.3","Analisar se foram atendidas as diligências solicitadas pela SGI e PGE",null,null,null,null,null,"SGI/SAEB",null,null,null,null,0,0,null,"Ì","Add","Ó","Remove",null,"","",""]
["A","3.4","Deliberar  sobre os termos do contrato, indicadores e metas (inciso V, §2º, art. 2º da Lei 8.647/2003) e publicar resolução no Diário Oficial do Estado",null,null,null,null,null,"CONGEOS",null,null,null,null,0,0,null,"Ì","Add","Ó","Remove",null,23,"",""]
["S","4.","Seleção da Organização Social",null,null,null,null,null,null,{"$f":"IFERROR(AVERAGE(INDIRECT(ADDRESS(ROW()+1,COLUMN())&\":\"&ADDRESS(ROW()+INDIRECT(\"X\"&ROW()),COLUMN()))),\"\")","v":""},null,null,null,{"$f":"IFERROR(AVERAGE(INDIRECT(ADDRESS(ROW()+1,COLUMN())&\":\"&ADDRESS(ROW()+INDIRECT(\"X\"&ROW()),COLUMN()))),\"\")","v":""},"",null,"Ì","Add","Ó","Remove",null,{"$f":"IF(INDIRECT(\"A\"&ROW())=\"S\",INDIRECT(\"W\"&ROW()+1),IF(INDIRECT(\"A\"&ROW()+1)=\"s\",ROW()+1,INDIRECT(\"W\"&ROW()+1)))","v":0},{"$f":"IF(INDIRECT(\"A\"&ROW())=\"S\",INDIRECT(\"W\"&ROW())-ROW()-1,\"\")","v":2},{"$f":"IFERROR(IF(P23=\"Not Approved\",-1,VALUE(RIGHT(LEFT(P23,2),1))),\"\")","v":""}]
[null,"4.1","Publicação do edital ",null,null,null,null,null,"Comissão Julgadora",null,null,null,null,0,{"$f":"IFERROR(IF(COUNTIF(INDIRECT(CONCATENATE(\"I\",ROW(),\":O\",ROW())),\"N/A\")=7,\"N/A\",AVERAGE(INDIRECT(CONCATENATE(ADDRESS(ROW(),COLUMN()-7),\":\",ADDRESS(ROW(),COLUMN()-1))))),\"\")","v":0}]
[null,"4.2","Recebimento das propostas de trabalho (proposta técnicas e habilitações jurídico-fiscal).",null,null,null,null,null,"Comissão Julgadora",null,null,null,null,0,{"$f":"IFERROR(IF(COUNTIF(INDIRECT(CONCATENATE(\"I\",ROW(),\":O\",ROW())),\"N/A\")=7,\"N/A\",AVERAGE(INDIRECT(CONCATENATE(ADDRESS(ROW(),COLUMN()-7),\":\",ADDRESS(ROW(),COLUMN()-1))))),\"\")","v":0}]
["A","4.3","Julgamento das propostas técnicas apresentadas pelas entidades",null,null,null,null,null,"Comissão Julgadora",null,null,null,null,0,{"$f":"IFERROR(IF(COUNTIF(INDIRECT(CONCATENATE(\"I\",ROW(),\":O\",ROW())),\"N/A\")=7,\"N/A\",AVERAGE(INDIRECT(CONCATENATE(ADDRESS(ROW(),COLUMN()-7),\":\",ADDRESS(ROW(),COLUMN()-1))))),\"\")","v":0},null,"Ì","Add","Ó","Remove",null,0,"",""]
[null,"4.4","Homologação  do resultado do processo de seleção e adjudicação do objeto",null,null,null,null,null,"Gabinete da Secretaria Interessada",null,null,null,null,0,{"$f":"IFERROR(IF(COUNTIF(INDIRECT(CONCATENATE(\"I\",ROW(),\":O\",ROW())),\"N/A\")=7,\"N/A\",AVERAGE(INDIRECT(CONCATENATE(ADDRESS(ROW(),COLUMN()-7),\":\",ADDRESS(ROW(),COLUMN()-1))))),\"\")","v":0}]
[null,"4.5","Assinatura do contrato de gestão e publicação do resumo no Diário Oficial do Estado",null,null,null,null,null,"Gabinete da Secretaria Interessada",null,null,null,null,0,{"$f":"IFERROR(IF(COUNTIF(INDIRECT(CONCATENATE(\"I\",ROW(),\":O\",ROW())),\"N/A\")=7,\"N/A\",AVERAGE(INDIRECT(CONCATENATE(ADDRESS(ROW(),COLUMN()-7),\":\",ADDRESS(ROW(),COLUMN()-1))))),\"\")","v":0},null,"Ì","Add","Ó","Remove",null,0,"",""]
[]
[null,"Ì","Add Level 3 Process",null,null,null,null,null,null,null,null,null,null,null,null,null,null,null,null,null,null,{"$f":"ROW()","v":30},"",""]

{"sheet":"ConnectionMask","index":2,"n_rows":203,"n_cols":16,"rows_kept":203,"cut":false,"hidden":true,"merged":[]}
["Total Rows",null,"Total \"A\" Rows","Consolidated Start","Consolidated End",null,"Start Row","End Row"]
[{"$f":"COUNTIF($D$6:$D$203,\"S\")+COUNTIF($D$6:$D$203,\"A\")","v":12},null,{"$f":"H2-G2","v":13},{"$f":"ROW(E6)","v":6},{"$f":"D2+C2","v":19},null,{"$f":"ROW(INDIRECT(\"'\"&INDEX(MID(SheetNames,FIND(\"]\",SheetNames)+1,255),ROWS(A$4:$A$4))&\"'!\"&\"TaskFirstRow\"))+1","v":13},{"$f":"ROW(INDIRECT(\"'\"&INDEX(MID(SheetNames,FIND(\"]\",SheetNames)+1,255),ROWS(A$4:$A$4))&\"'!\"&\"ProjectLastRow\"))-1","v":26}]
[]
[null,null,null,"A","B","C","H","I","J","K","L","M","N","O","P","Q"]
["Row Number","Row ID","Workstream","Task Type","WBS #","Description","Due Date","VAC \n(To Be)","EPC \n(To Be)","FAD \n(To Be)","Screen Capturing","Template \n(As Is)","System GAPs","Process GAPs","Overall Progress","Approved By"]
[{"$f":"ROW(INDIRECT(\"'\"&INDEX(MID(SheetNames,FIND(\"]\",SheetNames)+1,255),ROWS(A$4:$A$4))&\"'!\"&\"TaskFirstRow\"))+1","v":13},{"$f":"IF(D6=\"\",\"\",C6&\"_\"&E6)","v":"Publicização_1."},{"$f":"INDEX(MID(SheetNames,FIND(\"]\",SheetNames)+1,255),ROWS(A$4:$A$4))","v":"Publicização"},{"$f":"IF(OR(ISBLANK(INDIRECT(\"'\"&$C6&\"'!\"&D$4&$A6)),ISERROR(INDIRECT(\"'\"&$C6&\"'!\"&D$4&$A6))),\"\",INDIRECT(\"'\"&$C6&\"'!\"&D$4&$A6))","v":"S"},{"$f":"IF(OR(ISBLANK(INDIRECT(\"'\"&$C6&\"'!\"&E$4&$A6)),ISERROR(INDIRECT(\"'\"&$C6&\"'!\"&E$4&$A6))),\"\",INDIRECT(\"'\"&$C6&\"'!\"&E$4&$A6))","v":"1."},"Manifestação de Interesse e Designação da Comissão de Publicização","","","","","","","","","","Ì"]
[{"$f":"IF(INDIRECT(ADDRESS(ROW()-1,COLUMN()))+1>ROW(INDIRECT(\"'\"&INDEX(MID(SheetNames,FIND(\"]\",SheetNames)+1,255),ROWS(A$4:$A$4))&\"'!\"&\"ProjectLastRow\"))-1,\"\",IF(ISERROR(VLOOKUP(ROW(),$T$6:$W$25,4,0)),A6+1,VLOOKUP(ROW(),$T$6:$W$25,4,0)))","v":14},{"$f":"IF(D7=\"\",\"\",C7&\"_\"&E7)","v":"Publicização_1.1"},{"$f":"INDEX(MID(SheetNames,FIND(\"]\",SheetNames)+1,255),ROWS(A$4:$A$4))","v":"Publicização"},{"$f":"IF(OR(ISBLANK(INDIRECT(\"'\"&$C7&\"'!\"&D$4&$A7)),ISERROR(INDIRECT(\"'\"&$C7&\"'!\"&D$4&$A7))),\"\",INDIRECT(\"'\"&$C7&\"'!\"&D$4&$A7))","v":"A"},"1.1","Emissão do Ofício de manifestação de interesse de publicização ","","Gabinete da Secretaria Interessada","","","","",0,"","","Ì"]
[{"$f":"IF(INDIRECT(ADDRESS(ROW()-1,COLUMN()))+1>ROW(INDIRECT(\"'\"&INDEX(MID(SheetNames,FIND(\"]\",SheetNames)+1,255),ROWS(A$4:$A$4))&\"'!\"&\"ProjectLastRow\"))-1,\"\",IF(ISERROR(VLOOKUP(ROW(),$T$6:$W$25,4,0)),A7+1,VLOOKUP(ROW(),$T$6:$W$25,4,0)))","v":15},"",{"$f":"INDEX(MID(SheetNames,FIND(\"]\",SheetNames)+1,255),ROWS(A$4:$A$4))","v":"Publicização"},"","1.2","Designação da comissão de publicização","","Gabinete da Secretaria Interessada","","","","",0,"","","Ì"]
[{"$f":"IF(INDIRECT(ADDRESS(ROW()-1,COLUMN()))+1>ROW(INDIRECT(\"'\"&INDEX(MID(SheetNames,FIND(\"]\",SheetNames)+1,255),ROWS(A$4:$A$4))&\"'!\"&\"ProjectLastRow\"))-1,\"\",IF(ISERROR(VLOOKUP(ROW(),$T$6:$W$25,4,0)),A8+1,VLOOKUP(ROW(),$T$6:$W$25,4,0)))","v":16},"Publicização_2",{"$f":"INDEX(MID(SheetNames,FIND(\"]\",SheetNames)+1,255),ROWS(A$4:$A$4))","v":"Publicização"},"S",2,"Elaboração do Projeto de Publicização com Assessoria da SGI/SAEB","","","","","","","","","","Ì"]
[{"$f":"IF(INDIRECT(ADDRESS(ROW()-1,COLUMN()))+1>ROW(INDIRECT(\"'\"&INDEX(MID(SheetNames,FIND(\"]\",SheetNames)+1,255),ROWS(A$4:$A$4))&\"'!\"&\"ProjectLastRow\"))-1,\"\",IF(ISERROR(VLOOKUP(ROW(),$T$6:$W$25,4,0)),A9+1,VLOOKUP(ROW(),$T$6:$W$25,4,0)))","v":17},"",{"$f":"INDEX(MID(SheetNames,FIND(\"]\",SheetNames)+1,255),ROWS(A$4:$A$4))","v":"Publicização"},"","2.2","Levantamento de informações do serviço a ser publicizado","","Comissão de Publicização","","","","",0,"","","Ì"]
[{"$f":"IF(INDIRECT(ADDRESS(ROW()-1,COLUMN()))+1>ROW(INDIRECT(\"'\"&INDEX(MID(SheetNames,FIND(\"]\",SheetNames)+1,255),ROWS(A$4:$A$4))&\"'!\"&\"ProjectLastRow\"))-1,\"\",IF(ISERROR(VLOOKUP(ROW(),$T$6:$W$25,4,0)),A10+1,VLOOKUP(ROW(),$T$6:$W$25,4,0)))","v":18},"Publicização_2.3",{"$f":"INDEX(MID(SheetNames,FIND(\"]\",SheetNames)+1,255),ROWS(A$4:$A$4))","v":"Publicização"},"A","2.3","Redação do Projeto de Publicização","","Comissão de Publicização","","","","",0,"","","Ì"]
[{"$f":"IF(INDIRECT(ADDRESS(ROW()-1,COLUMN()))+1>ROW(INDIRECT(\"'\"&INDEX(MID(SheetNames,FIND(\"]\",SheetNames)+1,255),ROWS(A$4:$A$4))&\"'!\"&\"ProjectLastRow\"))-1,\"\",IF(ISERROR(VLOOKUP(ROW(),$T$6:$W$25,4,0)),A11+1,VLOOKUP(ROW(),$T$6:$W$25,4,0)))","v":19},"Publicização_2.4",{"$f":"INDEX(MID(SheetNames,FIND(\"]\",SheetNames)+1,255),ROWS(A$4:$A$4))","v":"Publicização"},"A","2.4","Realização da Avaliação ex ante","","UGC","","","","",0,"","","Ì"]
[{"$f":"IF(INDIRECT(ADDRESS(ROW()-1,COLUMN()))+1>ROW(INDIRECT(\"'\"&INDEX(MID(SheetNames,FIND(\"]\",SheetNames)+1,255),ROWS(A$4:$A$4))&\"'!\"&\"ProjectLastRow\"))-1,\"\",IF(ISERROR(VLOOKUP(ROW(),$T$6:$W$25,4,0)),A12+1,VLOOKUP(ROW(),$T$6:$W$25,4,0)))","v":20},"Publicização_2.5",{"$f":"INDEX(MID(SheetNames,FIND(\"]\",SheetNames)+1,255),ROWS(A$4:$A$4))","v":"Publicização"},"A","2.5","Validação do Projeto","","Gabinete da Secretaria Interessada","","","","",0,"","","Ì"]
[{"$f":"IF(INDIRECT(ADDRESS(ROW()-1,COLUMN()))+1>ROW(INDIRECT(\"'\"&INDEX(MID(SheetNames,FIND(\"]\",SheetNames)+1,255),ROWS(A$4:$A$4))&\"'!\"&\"ProjectLastRow\"))-1,\"\",IF(ISERROR(VLOOKUP(ROW(),$T$6:$W$25,4,0)),A13+1,VLOOKUP(ROW(),$T$6:$W$25,4,0)))","v":21},"Publicização_3.",{"$f":"INDEX(MID(SheetNames,FIND(\"]\",SheetNames)+1,255),ROWS(A$4:$A$4))","v":"Publicização"},"S","3.","Publicização","","","","","","","","","","Ì"]
[{"$f":"IF(INDIRECT(ADDRESS(ROW()-1,COLUMN()))+1>ROW(INDIRECT(\"'\"&INDEX(MID(SheetNames,FIND(\"]\",SheetNames)+1,255),ROWS(A$4:$A$4))&\"'!\"&\"ProjectLastRow\"))-1,\"\",IF(ISERROR(VLOOKUP(ROW(),$T$6:$W$25,4,0)),A14+1,VLOOKUP(ROW(),$T$6:$W$25,4,0)))","v":22},"Publicização_3.1",{"$f":"INDEX(MID(SheetNames,FIND(\"]\",SheetNames)+1,255),ROWS(A$4:$A$4))","v":"Publicização"},"A","3.1","Emissão do Parecer de Conveniência e Oportunidade","","Gabinete da Secretaria Interessada","","","","",0,"","","Ì"]
[{"$f":"IF(INDIRECT(ADDRESS(ROW()-1,COLUMN()))+1>ROW(INDIRECT(\"'\"&INDEX(MID(SheetNames,FIND(\"]\",SheetNames)+1,255),ROWS(A$4:$A$4))&\"'!\"&\"ProjectLastRow\"))-1,\"\",IF(ISERROR(VLOOKUP(ROW(),$T$6:$W$25,4,0)),A15+1,VLOOKUP(ROW(),$T$6:$W$25,4,0)))","v":23},"Publicização_3.2",{"$f":"INDEX(MID(SheetNames,FIND(\"]\",SheetNames)+1,255),ROWS(A$4:$A$4))","v":"Publicização"},"A","3.2","Emissão de parecer técnico sobre o Projeto de Publicização","","SGI/SAEB","","","","",0,"","","Ì"]
[{"$f":"IF(INDIRECT(ADDRESS(ROW()-1,COLUMN()))+1>ROW(INDIRECT(\"'\"&INDEX(MID(SheetNames,FIND(\"]\",SheetNames)+1,255),ROWS(A$4:$A$4))&\"'!\"&\"ProjectLastRow\"))-1,\"\",IF(ISERROR(VLOOKUP(ROW(),$T$6:$W$25,4,0)),A16+1,VLOOKUP(ROW(),$T$6:$W$25,4,0)))","v":24},"Publicização_3.3",{"$f":"INDEX(MID(SheetNames,FIND(\"]\",SheetNames)+1,255),ROWS(A$4:$A$4))","v":"Publicização"},"A","3.3","Emissão e publicação no Diário Oficial do Estado de resolução sobre o pedido de publicização ","","CONGEOS","","","","",0,"","","Ì"]
[{"$f":"IF(INDIRECT(ADDRESS(ROW()-1,COLUMN()))+1>ROW(INDIRECT(\"'\"&INDEX(MID(SheetNames,FIND(\"]\",SheetNames)+1,255),ROWS(A$4:$A$4))&\"'!\"&\"ProjectLastRow\"))-1,\"\",IF(ISERROR(VLOOKUP(ROW(),$T$6:$W$25,4,0)),A17+1,VLOOKUP(ROW(),$T$6:$W$25,4,0)))","v":25},"Publicização_3.4",{"$f":"INDEX(MID(SheetNames,FIND(\"]\",SheetNames)+1,255),ROWS(A$4:$A$4))","v":"Publicização"},"A","3.4","Publicação, no Diário Oficial do Estado, do autorizo da publicização pelo Governador ","","Casa Civil","","","","",0,"","","Ì"]
[{"$f":"IF(INDIRECT(ADDRESS(ROW()-1,COLUMN()))+1>ROW(INDIRECT(\"'\"&INDEX(MID(SheetNames,FIND(\"]\",SheetNames)+1,255),ROWS(A$4:$A$4))&\"'!\"&\"ProjectLastRow\"))-1,\"\",IF(ISERROR(VLOOKUP(ROW(),$T$6:$W$25,4,0)),A18+1,VLOOKUP(ROW(),$T$6:$W$25,4,0)))","v":26},"Publicização_3.5",{"$f":"INDEX(MID(SheetNames,FIND(\"]\",SheetNames)+1,255),ROWS(A$4:$A$4))","v":"Publicização"},"A","3.5","Publicação, no Diário Oficial do Estado,  da portaria de publicização ","","Gabinete da Secretaria Interessada","","","","",0,"","","Ì"]
[{"$f":"IF(INDIRECT(ADDRESS(ROW()-1,COLUMN()))+1>ROW(INDIRECT(\"'\"&INDEX(MID(SheetNames,FIND(\"]\",SheetNames)+1,255),ROWS(A$4:$A$4))&\"'!\"&\"ProjectLastRow\"))-1,\"\",IF(ISERROR(VLOOKUP(ROW(),$T$6:$W$25,4,0)),A19+1,VLOOKUP(ROW(),$T$6:$W$25,4,0)))","v":""},"",{"$f":"INDEX(MID(SheetNames,FIND(\"]\",SheetNames)+1,255),ROWS(A$4:$A$4))","v":"Publicização"},"","","","","","","","","","","","",""]
[{"$f":"IF(INDIRECT(ADDRESS(ROW()-1,COLUMN()))+1>ROW(INDIRECT(\"'\"&INDEX(MID(SheetNames,FIND(\"]\",SheetNames)+1,255),ROWS(A$4:$A$4))&\"'!\"&\"ProjectLastRow\"))-1,\"\",IF(ISERROR(VLOOKUP(ROW(),$T$6:$W$25,4,0)),A20+1,VLOOKUP(ROW(),$T$6:$W$25,4,0)))","v":{"$error":"#VALUE!"}},"",{"$f":"INDEX(MID(SheetNames,FIND(\"]\",SheetNames)+1,255),ROWS(A$4:$A$4))","v":"Publicização"},"","","","","","","","","","","","",""]
[{"$f":"IF(INDIRECT(ADDRESS(ROW()-1,COLUMN()))+1>ROW(INDIRECT(\"'\"&INDEX(MID(SheetNames,FIND(\"]\",SheetNames)+1,255),ROWS(A$4:$A$4))&\"'!\"&\"ProjectLastRow\"))-1,\"\",IF(ISERROR(VLOOKUP(ROW(),$T$6:$W$25,4,0)),A21+1,VLOOKUP(ROW(),$T$6:$W$25,4,0)))","v":{"$error":"#VALUE!"}},"",{"$f":"INDEX(MID(SheetNames,FIND(\"]\",SheetNames)+1,255),ROWS(A$4:$A$4))","v":"Publicização"},"","","","","","","","","","","","",""]
[{"$f":"IF(INDIRECT(ADDRESS(ROW()-1,COLUMN()))+1>ROW(INDIRECT(\"'\"&INDEX(MID(SheetNames,FIND(\"]\",SheetNames)+1,255),ROWS(A$4:$A$4))&\"'!\"&\"ProjectLastRow\"))-1,\"\",IF(ISERROR(VLOOKUP(ROW(),$T$6:$W$25,4,0)),A22+1,VLOOKUP(ROW(),$T$6:$W$25,4,0)))","v":{"$error":"#VALUE!"}},"",{"$f":"INDEX(MID(SheetNames,FIND(\"]\",SheetNames)+1,255),ROWS(A$4:$A$4))","v":"Publicização"},{"$f":"IF(OR(ISBLANK(INDIRECT(\"'\"&$C23&\"'!\"&D$4&$A23)),ISERROR(INDIRECT(\"'\"&$C23&\"'!\"&D$4&$A23))),\"\",INDIRECT(\"'\"&$C23&\"'!\"&D$4&$A23))","v":""},"","","","","","","","","","","",""]
[{"$f":"IF(INDIRECT(ADDRESS(ROW()-1,COLUMN()))+1>ROW(INDIRECT(\"'\"&INDEX(MID(SheetNames,FIND(\"]\",SheetNames)+1,255),ROWS(A$4:$A$4))&\"'!\"&\"ProjectLastRow\"))-1,\"\",IF(ISERROR(VLOOKUP(ROW(),$T$6:$W$25,4,0)),A23+1,VLOOKUP(ROW(),$T$6:$W$25,4,0)))","v":{"$error":"#VALUE!"}},"",{"$f":"INDEX(MID(SheetNames,FIND(\"]\",SheetNames)+1,255),ROWS(A$4:$A$4))","v":"Publicização"},"","","","","","","","","","","","",""]
[{"$f":"IF(INDIRECT(ADDRESS(ROW()-1,COLUMN()))+1>ROW(INDIRECT(\"'\"&INDEX(MID(SheetNames,FIND(\"]\",SheetNames)+1,255),ROWS(A$4:$A$4))&\"'!\"&\"ProjectLastRow\"))-1,\"\",IF(ISERROR(VLOOKUP(ROW(),$T$6:$W$25,4,0)),A24+1,VLOOKUP(ROW(),$T$6:$W$25,4,0)))","v":{"$error":"#VALUE!"}},"",{"$f":"INDEX(MID(SheetNames,FIND(\"]\",SheetNames)+1,255),ROWS(A$4:$A$4))","v":"Publicização"},"","","","","","","","","","","","",""]
[{"$f":"IF(INDIRECT(ADDRESS(ROW()-1,COLUMN()))+1>ROW(INDIRECT(\"'\"&INDEX(MID(SheetNames,FIND(\"]\",SheetNames)+1,255),ROWS(A$4:$A$4))&\"'!\"&\"ProjectLastRow\"))-1,\"\",IF(ISERROR(VLOOKUP(ROW(),$T$6:$W$25,4,0)),A25+1,VLOOKUP(ROW(),$T$6:$W$25,4,0)))","v":{"$error":"#VALUE!"}},"",{"$f":"INDEX(MID(SheetNames,FIND(\"]\",SheetNames)+1,255),ROWS(A$4:$A$4))","v":"Publicização"},"","","","","","","","","","","","",""]
[{"$f":"IF(INDIRECT(ADDRESS(ROW()-1,COLUMN()))+1>ROW(INDIRECT(\"'\"&INDEX(MID(SheetNames,FIND(\"]\",SheetNames)+1,255),ROWS(A$4:$A$4))&\"'!\"&\"ProjectLastRow\"))-1,\"\",IF(ISERROR(VLOOKUP(ROW(),$T$6:$W$25,4,0)),A26+1,VLOOKUP(ROW(),$T$6:$W$25,4,0)))","v":{"$error":"#VALUE!"}},"",{"$f":"INDEX(MID(SheetNames,FIND(\"]\",SheetNames)+1,255),ROWS(A$4:$A$4))","v":"Publicização"},"","","","","","","","","","","","",""]
[{"$f":"IF(INDIRECT(ADDRESS(ROW()-1,COLUMN()))+1>ROW(INDIRECT(\"'\"&INDEX(MID(SheetNames,FIND(\"]\",SheetNames)+1,255),ROWS(A$4:$A$4))&\"'!\"&\"ProjectLastRow\"))-1,\"\",IF(ISERROR(VLOOKUP(ROW(),$T$6:$W$25,4,0)),A27+1,VLOOKUP(ROW(),$T$6:$W$25,4,0)))","v":{"$error":"#VALUE!"}},"",{"$f":"INDEX(MID(SheetNames,FIND(\"]\",SheetNames)+1,255),ROWS(A$4:$A$4))","v":"Publicização"},"","","","","","","","","","","","",""]
[{"$f":"IF(INDIRECT(ADDRESS(ROW()-1,COLUMN()))+1>ROW(INDIRECT(\"'\"&INDEX(MID(SheetNames,FIND(\"]\",SheetNames)+1,255),ROWS(A$4:$A$4))&\"'!\"&\"ProjectLastRow\"))-1,\"\",IF(ISERROR(VLOOKUP(ROW(),$T$6:$W$25,4,0)),A28+1,VLOOKUP(ROW(),$T$6:$W$25,4,0)))","v":{"$error":"#VALUE!"}},"",{"$f":"INDEX(MID(SheetNames,FIND(\"]\",SheetNames)+1,255),ROWS(A$4:$A$4))","v":"Publicização"},"","","","","","","","","","","","",""]
[{"$f":"IF(INDIRECT(ADDRESS(ROW()-1,COLUMN()))+1>ROW(INDIRECT(\"'\"&INDEX(MID(SheetNames,FIND(\"]\",SheetNames)+1,255),ROWS(A$4:$A$4))&\"'!\"&\"ProjectLastRow\"))-1,\"\",IF(ISERROR(VLOOKUP(ROW(),$T$6:$W$25,4,0)),A29+1,VLOOKUP(ROW(),$T$6:$W$25,4,0)))","v":{"$error":"#VALUE!"}},"",{"$f":"INDEX(MID(SheetNames,FIND(\"]\",SheetNames)+1,255),ROWS(A$4:$A$4))","v":"Publicização"},"","","","","","","","","","","","",""]
[{"$f":"IF(INDIRECT(ADDRESS(ROW()-1,COLUMN()))+1>ROW(INDIRECT(\"'\"&INDEX(MID(SheetNames,FIND(\"]\",SheetNames)+1,255),ROWS(A$4:$A$4))&\"'!\"&\"ProjectLastRow\"))-1,\"\",IF(ISERROR(VLOOKUP(ROW(),$T$6:$W$25,4,0)),A30+1,VLOOKUP(ROW(),$T$6:$W$25,4,0)))","v":{"$error":"#VALUE!"}},"",{"$f":"INDEX(MID(SheetNames,FIND(\"]\",SheetNames)+1,255),ROWS(A$4:$A$4))","v":"Publicização"},"","","","","","","","","","","","",""]
[{"$f":"IF(INDIRECT(ADDRESS(ROW()-1,COLUMN()))+1>ROW(INDIRECT(\"'\"&INDEX(MID(SheetNames,FIND(\"]\",SheetNames)+1,255),ROWS(A$4:$A$4))&\"'!\"&\"ProjectLastRow\"))-1,\"\",IF(ISERROR(VLOOKUP(ROW(),$T$6:$W$25,4,0)),A31+1,VLOOKUP(ROW(),$T$6:$W$25,4,0)))","v":{"$error":"#VALUE!"}},"",{"$f":"INDEX(MID(SheetNames,FIND(\"]\",SheetNames)+1,255),ROWS(A$4:$A$4))","v":"Publicização"},"","","","","","","","","","","","",""]
[{"$f":"IF(INDIRECT(ADDRESS(ROW()-1,COLUMN()))+1>ROW(INDIRECT(\"'\"&INDEX(MID(SheetNames,FIND(\"]\",SheetNames)+1,255),ROWS(A$4:$A$4))&\"'!\"&\"ProjectLastRow\"))-1,\"\",IF(ISERROR(VLOOKUP(ROW(),$T$6:$W$25,4,0)),A32+1,VLOOKUP(ROW(),$T$6:$W$25,4,0)))","v":{"$error":"#VALUE!"}},"",{"$f":"INDEX(MID(SheetNames,FIND(\"]\",SheetNames)+1,255),ROWS(A$4:$A$4))","v":"Publicização"},"","","","","","","","","","","","",""]
[{"$f":"IF(INDIRECT(ADDRESS(ROW()-1,COLUMN()))+1>ROW(INDIRECT(\"'\"&INDEX(MID(SheetNames,FIND(\"]\",SheetNames)+1,255),ROWS(A$4:$A$4))&\"'!\"&\"ProjectLastRow\"))-1,\"\",IF(ISERROR(VLOOKUP(ROW(),$T$6:$W$25,4,0)),A33+1,VLOOKUP(ROW(),$T$6:$W$25,4,0)))","v":{"$error":"#VALUE!"}},"",{"$f":"INDEX(MID(SheetNames,FIND(\"]\",SheetNames)+1,255),ROWS(A$4:$A$4))","v":"Publicização"},"","","","","","","","","","","","",""]
[{"$f":"IF(INDIRECT(ADDRESS(ROW()-1,COLUMN()))+1>ROW(INDIRECT(\"'\"&INDEX(MID(SheetNames,FIND(\"]\",SheetNames)+1,255),ROWS(A$4:$A$4))&\"'!\"&\"ProjectLastRow\"))-1,\"\",IF(ISERROR(VLOOKUP(ROW(),$T$6:$W$25,4,0)),A34+1,VLOOKUP(ROW(),$T$6:$W$25,4,0)))","v":{"$error":"#VALUE!"}},"",{"$f":"INDEX(MID(SheetNames,FIND(\"]\",SheetNames)+1,255),ROWS(A$4:$A$4))","v":"Publicização"},"","","","","","","","","","","","",""]
[{"$f":"IF(INDIRECT(ADDRESS(ROW()-1,COLUMN()))+1>ROW(INDIRECT(\"'\"&INDEX(MID(SheetNames,FIND(\"]\",SheetNames)+1,255),ROWS(A$4:$A$4))&\"'!\"&\"ProjectLastRow\"))-1,\"\",IF(ISERROR(VLOOKUP(ROW(),$T$6:$W$25,4,0)),A35+1,VLOOKUP(ROW(),$T$6:$W$25,4,0)))","v":{"$error":"#VALUE!"}},"",{"$f":"INDEX(MID(SheetNames,FIND(\"]\",SheetNames)+1,255),ROWS(A$4:$A$4))","v":"Publicização"},"","","","","","","","","","","","",""]
[{"$f":"IF(INDIRECT(ADDRESS(ROW()-1,COLUMN()))+1>ROW(INDIRECT(\"'\"&INDEX(MID(SheetNames,FIND(\"]\",SheetNames)+1,255),ROWS(A$4:$A$4))&\"'!\"&\"ProjectLastRow\"))-1,\"\",IF(ISERROR(VLOOKUP(ROW(),$T$6:$W$25,4,0)),A36+1,VLOOKUP(ROW(),$T$6:$W$25,4,0)))","v":{"$error":"#VALUE!"}},"",{"$f":"INDEX(MID(SheetNames,FIND(\"]\",SheetNames)+1,255),ROWS(A$4:$A$4))","v":"Publicização"},"","","","","","","","","","","","",""]
[{"$f":"IF(INDIRECT(ADDRESS(ROW()-1,COLUMN()))+1>ROW(INDIRECT(\"'\"&INDEX(MID(SheetNames,FIND(\"]\",SheetNames)+1,255),ROWS(A$4:$A$4))&\"'!\"&\"ProjectLastRow\"))-1,\"\",IF(ISERROR(VLOOKUP(ROW(),$T$6:$W$25,4,0)),A37+1,VLOOKUP(ROW(),$T$6:$W$25,4,0)))","v":{"$error":"#VALUE!"}},"",{"$f":"INDEX(MID(SheetNames,FIND(\"]\",SheetNames)+1,255),ROWS(A$4:$A$4))","v":"Publicização"},"","","","","","","","","","","","",""]
[{"$f":"IF(INDIRECT(ADDRESS(ROW()-1,COLUMN()))+1>ROW(INDIRECT(\"'\"&INDEX(MID(SheetNames,FIND(\"]\",SheetNames)+1,255),ROWS(A$4:$A$4))&\"'!\"&\"ProjectLastRow\"))-1,\"\",IF(ISERROR(VLOOKUP(ROW(),$T$6:$W$25,4,0)),A38+1,VLOOKUP(ROW(),$T$6:$W$25,4,0)))","v":{"$error":"#VALUE!"}},"",{"$f":"INDEX(MID(SheetNames,FIND(\"]\",SheetNames)+1,255),ROWS(A$4:$A$4))","v":"Publicização"},{"$f":"IF(OR(ISBLANK(INDIRECT(\"'\"&$C39&\"'!\"&D$4&$A39)),ISERROR(INDIRECT(\"'\"&$C39&\"'!\"&D$4&$A39))),\"\",INDIRECT(\"'\"&$C39&\"'!\"&D$4&$A39))","v":""},"","","","","","","","","","","",""]
[{"$f":"IF(INDIRECT(ADDRESS(ROW()-1,COLUMN()))+1>ROW(INDIRECT(\"'\"&INDEX(MID(SheetNames,FIND(\"]\",SheetNames)+1,255),ROWS(A$4:$A$4))&\"'!\"&\"ProjectLastRow\"))-1,\"\",IF(ISERROR(VLOOKUP(ROW(),$T$6:$W$25,4,0)),A39+1,VLOOKUP(ROW(),$T$6:$W$25,4,0)))","v":{"$error":"#VALUE!"}},"",{"$f":"INDEX(MID(SheetNames,FIND(\"]\",SheetNames)+1,255),ROWS(A$4:$A$4))","v":"Publicização"},"","","","","","","","","","","","",""]
[{"$f":"IF(INDIRECT(ADDRESS(ROW()-1,COLUMN()))+1>ROW(INDIRECT(\"'\"&INDEX(MID(SheetNames,FIND(\"]\",SheetNames)+1,255),ROWS(A$4:$A$4))&\"'!\"&\"ProjectLastRow\"))-1,\"\",IF(ISERROR(VLOOKUP(ROW(),$T$6:$W$25,4,0)),A40+1,VLOOKUP(ROW(),$T$6:$W$25,4,0)))","v":{"$error":"#VALUE!"}},"",{"$f":"INDEX(MID(SheetNames,FIND(\"]\",SheetNames)+1,255),ROWS(A$4:$A$4))","v":"Publicização"},"","","","","","","","","","","","",""]
[{"$f":"IF(INDIRECT(ADDRESS(ROW()-1,COLUMN()))+1>ROW(INDIRECT(\"'\"&INDEX(MID(SheetNames,FIND(\"]\",SheetNames)+1,255),ROWS(A$4:$A$4))&\"'!\"&\"ProjectLastRow\"))-1,\"\",IF(ISERROR(VLOOKUP(ROW(),$T$6:$W$25,4,0)),A41+1,VLOOKUP(ROW(),$T$6:$W$25,4,0)))","v":{"$error":"#VALUE!"}},"",{"$f":"INDEX(MID(SheetNames,FIND(\"]\",SheetNames)+1,255),ROWS(A$4:$A$4))","v":"Publicização"},"","","","","","","","","","","","",""]
[{"$f":"IF(INDIRECT(ADDRESS(ROW()-1,COLUMN()))+1>ROW(INDIRECT(\"'\"&INDEX(MID(SheetNames,FIND(\"]\",SheetNames)+1,255),ROWS(A$4:$A$4))&\"'!\"&\"ProjectLastRow\"))-1,\"\",IF(ISERROR(VLOOKUP(ROW(),$T$6:$W$25,4,0)),A42+1,VLOOKUP(ROW(),$T$6:$W$25,4,0)))","v":{"$error":"#VALUE!"}},"",{"$f":"INDEX(MID(SheetNames,FIND(\"]\",SheetNames)+1,255),ROWS(A$4:$A$4))","v":"Publicização"},"","","","","","","","","","","","",""]
[{"$f":"IF(INDIRECT(ADDRESS(ROW()-1,COLUMN()))+1>ROW(INDIRECT(\"'\"&INDEX(MID(SheetNames,FIND(\"]\",SheetNames)+1,255),ROWS(A$4:$A$4))&\"'!\"&\"ProjectLastRow\"))-1,\"\",IF(ISERROR(VLOOKUP(ROW(),$T$6:$W$25,4,0)),A43+1,VLOOKUP(ROW(),$T$6:$W$25,4,0)))","v":{"$error":"#VALUE!"}},"",{"$f":"INDEX(MID(SheetNames,FIND(\"]\",SheetNames)+1,255),ROWS(A$4:$A$4))","v":"Publicização"},"","","","","","","","","","","","",""]
[{"$f":"IF(INDIRECT(ADDRESS(ROW()-1,COLUMN()))+1>ROW(INDIRECT(\"'\"&INDEX(MID(SheetNames,FIND(\"]\",SheetNames)+1,255),ROWS(A$4:$A$4))&\"'!\"&\"ProjectLastRow\"))-1,\"\",IF(ISERROR(VLOOKUP(ROW(),$T$6:$W$25,4,0)),A44+1,VLOOKUP(ROW(),$T$6:$W$25,4,0)))","v":{"$error":"#VALUE!"}},"",{"$f":"INDEX(MID(SheetNames,FIND(\"]\",SheetNames)+1,255),ROWS(A$4:$A$4))","v":"Publicização"},"","","","","","","","","","","","",""]
[{"$f":"IF(INDIRECT(ADDRESS(ROW()-1,COLUMN()))+1>ROW(INDIRECT(\"'\"&INDEX(MID(SheetNames,FIND(\"]\",SheetNames)+1,255),ROWS(A$4:$A$4))&\"'!\"&\"ProjectLastRow\"))-1,\"\",IF(ISERROR(VLOOKUP(ROW(),$T$6:$W$25,4,0)),A45+1,VLOOKUP(ROW(),$T$6:$W$25,4,0)))","v":{"$error":"#VALUE!"}},"",{"$f":"INDEX(MID(SheetNames,FIND(\"]\",SheetNames)+1,255),ROWS(A$4:$A$4))","v":"Publicização"},"","","","","","","","","","","","",""]
[{"$f":"IF(INDIRECT(ADDRESS(ROW()-1,COLUMN()))+1>ROW(INDIRECT(\"'\"&INDEX(MID(SheetNames,FIND(\"]\",SheetNames)+1,255),ROWS(A$4:$A$4))&\"'!\"&\"ProjectLastRow\"))-1,\"\",IF(ISERROR(VLOOKUP(ROW(),$T$6:$W$25,4,0)),A46+1,VLOOKUP(ROW(),$T$6:$W$25,4,0)))","v":{"$error":"#VALUE!"}},"",{"$f":"INDEX(MID(SheetNames,FIND(\"]\",SheetNames)+1,255),ROWS(A$4:$A$4))","v":"Publicização"},"","","","","","","","","","","","",""]
[{"$f":"IF(INDIRECT(ADDRESS(ROW()-1,COLUMN()))+1>ROW(INDIRECT(\"'\"&INDEX(MID(SheetNames,FIND(\"]\",SheetNames)+1,255),ROWS(A$4:$A$4))&\"'!\"&\"ProjectLastRow\"))-1,\"\",IF(ISERROR(VLOOKUP(ROW(),$T$6:$W$25,4,0)),A47+1,VLOOKUP(ROW(),$T$6:$W$25,4,0)))","v":{"$error":"#VALUE!"}},"",{"$f":"INDEX(MID(SheetNames,FIND(\"]\",SheetNames)+1,255),ROWS(A$4:$A$4))","v":"Publicização"},"","","","","","","","","","","","",""]
[{"$f":"IF(INDIRECT(ADDRESS(ROW()-1,COLUMN()))+1>ROW(INDIRECT(\"'\"&INDEX(MID(SheetNames,FIND(\"]\",SheetNames)+1,255),ROWS(A$4:$A$4))&\"'!\"&\"ProjectLastRow\"))-1,\"\",IF(ISERROR(VLOOKUP(ROW(),$T$6:$W$25,4,0)),A48+1,VLOOKUP(ROW(),$T$6:$W$25,4,0)))","v":{"$error":"#VALUE!"}},"",{"$f":"INDEX(MID(SheetNames,FIND(\"]\",SheetNames)+1,255),ROWS(A$4:$A$4))","v":"Publicização"},"","","","","","","","","","","","",""]
[{"$f":"IF(INDIRECT(ADDRESS(ROW()-1,COLUMN()))+1>ROW(INDIRECT(\"'\"&INDEX(MID(SheetNames,FIND(\"]\",SheetNames)+1,255),ROWS(A$4:$A$4))&\"'!\"&\"ProjectLastRow\"))-1,\"\",IF(ISERROR(VLOOKUP(ROW(),$T$6:$W$25,4,0)),A49+1,VLOOKUP(ROW(),$T$6:$W$25,4,0)))","v":{"$error":"#VALUE!"}},"",{"$f":"INDEX(MID(SheetNames,FIND(\"]\",SheetNames)+1,255),ROWS(A$4:$A$4))","v":"Publicização"},"","","","","","","","","","","","",""]
[{"$f":"IF(INDIRECT(ADDRESS(ROW()-1,COLUMN()))+1>ROW(INDIRECT(\"'\"&INDEX(MID(SheetNames,FIND(\"]\",SheetNames)+1,255),ROWS(A$4:$A$4))&\"'!\"&\"ProjectLastRow\"))-1,\"\",IF(ISERROR(VLOOKUP(ROW(),$T$6:$W$25,4,0)),A50+1,VLOOKUP(ROW(),$T$6:$W$25,4,0)))","v":{"$error":"#VALUE!"}},"",{"$f":"INDEX(MID(SheetNames,FIND(\"]\",SheetNames)+1,255),ROWS(A$4:$A$4))","v":"Publicização"},"","","","","","","","","","","","",""]
[{"$f":"IF(INDIRECT(ADDRESS(ROW()-1,COLUMN()))+1>ROW(INDIRECT(\"'\"&INDEX(MID(SheetNames,FIND(\"]\",SheetNames)+1,255),ROWS(A$4:$A$4))&\"'!\"&\"ProjectLastRow\"))-1,\"\",IF(ISERROR(VLOOKUP(ROW(),$T$6:$W$25,4,0)),A51+1,VLOOKUP(ROW(),$T$6:$W$25,4,0)))","v":{"$error":"#VALUE!"}},"",{"$f":"INDEX(MID(SheetNames,FIND(\"]\",SheetNames)+1,255),ROWS(A$4:$A$4))","v":"Publicização"},"","","","","","","","","","","","",""]
[{"$f":"IF(INDIRECT(ADDRESS(ROW()-1,COLUMN()))+1>ROW(INDIRECT(\"'\"&INDEX(MID(SheetNames,FIND(\"]\",SheetNames)+1,255),ROWS(A$4:$A$4))&\"'!\"&\"ProjectLastRow\"))-1,\"\",IF(ISERROR(VLOOKUP(ROW(),$T$6:$W$25,4,0)),A52+1,VLOOKUP(ROW(),$T$6:$W$25,4,0)))","v":{"$error":"#VALUE!"}},"",{"$f":"INDEX(MID(SheetNames,FIND(\"]\",SheetNames)+1,255),ROWS(A$4:$A$4))","v":"Publicização"},"","","","","","","","","","","","",""]
[{"$f":"IF(INDIRECT(ADDRESS(ROW()-1,COLUMN()))+1>ROW(INDIRECT(\"'\"&INDEX(MID(SheetNames,FIND(\"]\",SheetNames)+1,255),ROWS(A$4:$A$4))&\"'!\"&\"ProjectLastRow\"))-1,\"\",IF(ISERROR(VLOOKUP(ROW(),$T$6:$W$25,4,0)),A53+1,VLOOKUP(ROW(),$T$6:$W$25,4,0)))","v":{"$error":"#VALUE!"}},"",{"$f":"INDEX(MID(SheetNames,FIND(\"]\",SheetNames)+1,255),ROWS(A$4:$A$4))","v":"Publicização"},"","","","","","","","","","","","",""]
[{"$f":"IF(INDIRECT(ADDRESS(ROW()-1,COLUMN()))+1>ROW(INDIRECT(\"'\"&INDEX(MID(SheetNames,FIND(\"]\",SheetNames)+1,255),ROWS(A$4:$A$4))&\"'!\"&\"ProjectLastRow\"))-1,\"\",IF(ISERROR(VLOOKUP(ROW(),$T$6:$W$25,4,0)),A54+1,VLOOKUP(ROW(),$T$6:$W$25,4,0)))","v":{"$error":"#VALUE!"}},"",{"$f":"INDEX(MID(SheetNames,FIND(\"]\",SheetNames)+1,255),ROWS(A$4:$A$4))","v":"Publicização"},{"$f":"IF(OR(ISBLANK(INDIRECT(\"'\"&$C55&\"'!\"&D$4&$A55)),ISERROR(INDIRECT(\"'\"&$C55&\"'!\"&D$4&$A55))),\"\",INDIRECT(\"'\"&$C55&\"'!\"&D$4&$A55))","v":""},"","","","","","","","","","","",""]
[{"$f":"IF(INDIRECT(ADDRESS(ROW()-1,COLUMN()))+1>ROW(INDIRECT(\"'\"&INDEX(MID(SheetNames,FIND(\"]\",SheetNames)+1,255),ROWS(A$4:$A$4))&\"'!\"&\"ProjectLastRow\"))-1,\"\",IF(ISERROR(VLOOKUP(ROW(),$T$6:$W$25,4,0)),A55+1,VLOOKUP(ROW(),$T$6:$W$25,4,0)))","v":{"$error":"#VALUE!"}},"",{"$f":"INDEX(MID(SheetNames,FIND(\"]\",SheetNames)+1,255),ROWS(A$4:$A$4))","v":"Publicização"},"","","","","","","","","","","","",""]
[{"$f":"IF(INDIRECT(ADDRESS(ROW()-1,COLUMN()))+1>ROW(INDIRECT(\"'\"&INDEX(MID(SheetNames,FIND(\"]\",SheetNames)+1,255),ROWS(A$4:$A$4))&\"'!\"&\"ProjectLastRow\"))-1,\"\",IF(ISERROR(VLOOKUP(ROW(),$T$6:$W$25,4,0)),A56+1,VLOOKUP(ROW(),$T$6:$W$25,4,0)))","v":{"$error":"#VALUE!"}},"",{"$f":"INDEX(MID(SheetNames,FIND(\"]\",SheetNames)+1,255),ROWS(A$4:$A$4))","v":"Publicização"},"","","","","","","","","","","","",""]
[{"$f":"IF(INDIRECT(ADDRESS(ROW()-1,COLUMN()))+1>ROW(INDIRECT(\"'\"&INDEX(MID(SheetNames,FIND(\"]\",SheetNames)+1,255),ROWS(A$4:$A$4))&\"'!\"&\"ProjectLastRow\"))-1,\"\",IF(ISERROR(VLOOKUP(ROW(),$T$6:$W$25,4,0)),A57+1,VLOOKUP(ROW(),$T$6:$W$25,4,0)))","v":{"$error":"#VALUE!"}},"",{"$f":"INDEX(MID(SheetNames,FIND(\"]\",SheetNames)+1,255),ROWS(A$4:$A$4))","v":"Publicização"},"","","","","","","","","","","","",""]
[{"$f":"IF(INDIRECT(ADDRESS(ROW()-1,COLUMN()))+1>ROW(INDIRECT(\"'\"&INDEX(MID(SheetNames,FIND(\"]\",SheetNames)+1,255),ROWS(A$4:$A$4))&\"'!\"&\"ProjectLastRow\"))-1,\"\",IF(ISERROR(VLOOKUP(ROW(),$T$6:$W$25,4,0)),A58+1,VLOOKUP(ROW(),$T$6:$W$25,4,0)))","v":{"$error":"#VALUE!"}},"",{"$f":"INDEX(MID(SheetNames,FIND(\"]\",SheetNames)+1,255),ROWS(A$4:$A$4))","v":"Publicização"},"","","","","","","","","","","","",""]
[{"$f":"IF(INDIRECT(ADDRESS(ROW()-1,COLUMN()))+1>ROW(INDIRECT(\"'\"&INDEX(MID(SheetNames,FIND(\"]\",SheetNames)+1,255),ROWS(A$4:$A$4))&\"'!\"&\"ProjectLastRow\"))-1,\"\",IF(ISERROR(VLOOKUP(ROW(),$T$6:$W$25,4,0)),A59+1,VLOOKUP(ROW(),$T$6:$W$25,4,0)))","v":{"$error":"#VALUE!"}},"",{"$f":"INDEX(MID(SheetNames,FIND(\"]\",SheetNames)+1,255),ROWS(A$4:$A$4))","v":"Publicização"},"","","","","","","","","","","","",""]
[{"$f":"IF(INDIRECT(ADDRESS(ROW()-1,COLUMN()))+1>ROW(INDIRECT(\"'\"&INDEX(MID(SheetNames,FIND(\"]\",SheetNames)+1,255),ROWS(A$4:$A$4))&\"'!\"&\"ProjectLastRow\"))-1,\"\",IF(ISERROR(VLOOKUP(ROW(),$T$6:$W$25,4,0)),A60+1,VLOOKUP(ROW(),$T$6:$W$25,4,0)))","v":{"$error":"#VALUE!"}},"",{"$f":"INDEX(MID(SheetNames,FIND(\"]\",SheetNames)+1,255),ROWS(A$4:$A$4))","v":"Publicização"},"","","","","","","","","","","","",""]
[{"$f":"IF(INDIRECT(ADDRESS(ROW()-1,COLUMN()))+1>ROW(INDIRECT(\"'\"&INDEX(MID(SheetNames,FIND(\"]\",SheetNames)+1,255),ROWS(A$4:$A$4))&\"'!\"&\"ProjectLastRow\"))-1,\"\",IF(ISERROR(VLOOKUP(ROW(),$T$6:$W$25,4,0)),A61+1,VLOOKUP(ROW(),$T$6:$W$25,4,0)))","v":{"$error":"#VALUE!"}},"",{"$f":"INDEX(MID(SheetNames,FIND(\"]\",SheetNames)+1,255),ROWS(A$4:$A$4))","v":"Publicização"},"","","","","","","","","","","","",""]
[{"$f":"IF(INDIRECT(ADDRESS(ROW()-1,COLUMN()))+1>ROW(INDIRECT(\"'\"&INDEX(MID(SheetNames,FIND(\"]\",SheetNames)+1,255),ROWS(A$4:$A$4))&\"'!\"&\"ProjectLastRow\"))-1,\"\",IF(ISERROR(VLOOKUP(ROW(),$T$6:$W$25,4,0)),A62+1,VLOOKUP(ROW(),$T$6:$W$25,4,0)))","v":{"$error":"#VALUE!"}},"",{"$f":"INDEX(MID(SheetNames,FIND(\"]\",SheetNames)+1,255),ROWS(A$4:$A$4))","v":"Publicização"},"","","","","","","","","","","","",""]
[{"$f":"IF(INDIRECT(ADDRESS(ROW()-1,COLUMN()))+1>ROW(INDIRECT(\"'\"&INDEX(MID(SheetNames,FIND(\"]\",SheetNames)+1,255),ROWS(A$4:$A$4))&\"'!\"&\"ProjectLastRow\"))-1,\"\",IF(ISERROR(VLOOKUP(ROW(),$T$6:$W$25,4,0)),A63+1,VLOOKUP(ROW(),$T$6:$W$25,4,0)))","v":{"$error":"#VALUE!"}},"",{"$f":"INDEX(MID(SheetNames,FIND(\"]\",SheetNames)+1,255),ROWS(A$4:$A$4))","v":"Publicização"},"","","","","","","","","","","","",""]
[{"$f":"IF(INDIRECT(ADDRESS(ROW()-1,COLUMN()))+1>ROW(INDIRECT(\"'\"&INDEX(MID(SheetNames,FIND(\"]\",SheetNames)+1,255),ROWS(A$4:$A$4))&\"'!\"&\"ProjectLastRow\"))-1,\"\",IF(ISERROR(VLOOKUP(ROW(),$T$6:$W$25,4,0)),A64+1,VLOOKUP(ROW(),$T$6:$W$25,4,0)))","v":{"$error":"#VALUE!"}},"",{"$f":"INDEX(MID(SheetNames,FIND(\"]\",SheetNames)+1,255),ROWS(A$4:$A$4))","v":"Publicização"},"","","","","","","","","","","","",""]
[{"$f":"IF(INDIRECT(ADDRESS(ROW()-1,COLUMN()))+1>ROW(INDIRECT(\"'\"&INDEX(MID(SheetNames,FIND(\"]\",SheetNames)+1,255),ROWS(A$4:$A$4))&\"'!\"&\"ProjectLastRow\"))-1,\"\",IF(ISERROR(VLOOKUP(ROW(),$T$6:$W$25,4,0)),A65+1,VLOOKUP(ROW(),$T$6:$W$25,4,0)))","v":{"$error":"#VALUE!"}},"",{"$f":"INDEX(MID(SheetNames,FIND(\"]\",SheetNames)+1,255),ROWS(A$4:$A$4))","v":"Publicização"},"","","","","","","","","","","","",""]
[{"$f":"IF(INDIRECT(ADDRESS(ROW()-1,COLUMN()))+1>ROW(INDIRECT(\"'\"&INDEX(MID(SheetNames,FIND(\"]\",SheetNames)+1,255),ROWS(A$4:$A$4))&\"'!\"&\"ProjectLastRow\"))-1,\"\",IF(ISERROR(VLOOKUP(ROW(),$T$6:$W$25,4,0)),A66+1,VLOOKUP(ROW(),$T$6:$W$25,4,0)))","v":{"$error":"#VALUE!"}},"",{"$f":"INDEX(MID(SheetNames,FIND(\"]\",SheetNames)+1,255),ROWS(A$4:$A$4))","v":"Publicização"},"","","","","","","","","","","","",""]
[{"$f":"IF(INDIRECT(ADDRESS(ROW()-1,COLUMN()))+1>ROW(INDIRECT(\"'\"&INDEX(MID(SheetNames,FIND(\"]\",SheetNames)+1,255),ROWS(A$4:$A$4))&\"'!\"&\"ProjectLastRow\"))-1,\"\",IF(ISERROR(VLOOKUP(ROW(),$T$6:$W$25,4,0)),A67+1,VLOOKUP(ROW(),$T$6:$W$25,4,0)))","v":{"$error":"#VALUE!"}},"",{"$f":"INDEX(MID(SheetNames,FIND(\"]\",SheetNames)+1,255),ROWS(A$4:$A$4))","v":"Publicização"},"","","","","","","","","","","","",""]
[{"$f":"IF(INDIRECT(ADDRESS(ROW()-1,COLUMN()))+1>ROW(INDIRECT(\"'\"&INDEX(MID(SheetNames,FIND(\"]\",SheetNames)+1,255),ROWS(A$4:$A$4))&\"'!\"&\"ProjectLastRow\"))-1,\"\",IF(ISERROR(VLOOKUP(ROW(),$T$6:$W$25,4,0)),A68+1,VLOOKUP(ROW(),$T$6:$W$25,4,0)))","v":{"$error":"#VALUE!"}},"",{"$f":"INDEX(MID(SheetNames,FIND(\"]\",SheetNames)+1,255),ROWS(A$4:$A$4))","v":"Publicização"},"","","","","","","","","","","","",""]
[{"$f":"IF(INDIRECT(ADDRESS(ROW()-1,COLUMN()))+1>ROW(INDIRECT(\"'\"&INDEX(MID(SheetNames,FIND(\"]\",SheetNames)+1,255),ROWS(A$4:$A$4))&\"'!\"&\"ProjectLastRow\"))-1,\"\",IF(ISERROR(VLOOKUP(ROW(),$T$6:$W$25,4,0)),A69+1,VLOOKUP(ROW(),$T$6:$W$25,4,0)))","v":{"$error":"#VALUE!"}},"",{"$f":"INDEX(MID(SheetNames,FIND(\"]\",SheetNames)+1,255),ROWS(A$4:$A$4))","v":"Publicização"},"","","","","","","","","","","","",""]
[{"$f":"IF(INDIRECT(ADDRESS(ROW()-1,COLUMN()))+1>ROW(INDIRECT(\"'\"&INDEX(MID(SheetNames,FIND(\"]\",SheetNames)+1,255),ROWS(A$4:$A$4))&\"'!\"&\"ProjectLastRow\"))-1,\"\",IF(ISERROR(VLOOKUP(ROW(),$T$6:$W$25,4,0)),A70+1,VLOOKUP(ROW(),$T$6:$W$25,4,0)))","v":{"$error":"#VALUE!"}},{"$f":"IF(D71=\"\",\"\",C71&\"_\"&E71)","v":""},{"$f":"INDEX(MID(SheetNames,FIND(\"]\",SheetNames)+1,255),ROWS(A$4:$A$4))","v":"Publicização"},{"$f":"IF(OR(ISBLANK(INDIRECT(\"'\"&$C71&\"'!\"&D$4&$A71)),ISERROR(INDIRECT(\"'\"&$C71&\"'!\"&D$4&$A71))),\"\",INDIRECT(\"'\"&$C71&\"'!\"&D$4&$A71))","v":""},"","","","","","","","","","","",""]
[{"$f":"IF(INDIRECT(ADDRESS(ROW()-1,COLUMN()))+1>ROW(INDIRECT(\"'\"&INDEX(MID(SheetNames,FIND(\"]\",SheetNames)+1,255),ROWS(A$4:$A$4))&\"'!\"&\"ProjectLastRow\"))-1,\"\",IF(ISERROR(VLOOKUP(ROW(),$T$6:$W$25,4,0)),A71+1,VLOOKUP(ROW(),$T$6:$W$25,4,0)))","v":{"$error":"#VALUE!"}},"",{"$f":"INDEX(MID(SheetNames,FIND(\"]\",SheetNames)+1,255),ROWS(A$4:$A$4))","v":"Publicização"},"","","","","","","","","","","","",""]
[{"$f":"IF(INDIRECT(ADDRESS(ROW()-1,COLUMN()))+1>ROW(INDIRECT(\"'\"&INDEX(MID(SheetNames,FIND(\"]\",SheetNames)+1,255),ROWS(A$4:$A$4))&\"'!\"&\"ProjectLastRow\"))-1,\"\",IF(ISERROR(VLOOKUP(ROW(),$T$6:$W$25,4,0)),A72+1,VLOOKUP(ROW(),$T$6:$W$25,4,0)))","v":{"$error":"#VALUE!"}},"",{"$f":"INDEX(MID(SheetNames,FIND(\"]\",SheetNames)+1,255),ROWS(A$4:$A$4))","v":"Publicização"},"","","","","","","","","","","","",""]
[{"$f":"IF(INDIRECT(ADDRESS(ROW()-1,COLUMN()))+1>ROW(INDIRECT(\"'\"&INDEX(MID(SheetNames,FIND(\"]\",SheetNames)+1,255),ROWS(A$4:$A$4))&\"'!\"&\"ProjectLastRow\"))-1,\"\",IF(ISERROR(VLOOKUP(ROW(),$T$6:$W$25,4,0)),A73+1,VLOOKUP(ROW(),$T$6:$W$25,4,0)))","v":{"$error":"#VALUE!"}},"",{"$f":"INDEX(MID(SheetNames,FIND(\"]\",SheetNames)+1,255),ROWS(A$4:$A$4))","v":"Publicização"},"","","","","","","","","","","","",""]
[{"$f":"IF(INDIRECT(ADDRESS(ROW()-1,COLUMN()))+1>ROW(INDIRECT(\"'\"&INDEX(MID(SheetNames,FIND(\"]\",SheetNames)+1,255),ROWS(A$4:$A$4))&\"'!\"&\"ProjectLastRow\"))-1,\"\",IF(ISERROR(VLOOKUP(ROW(),$T$6:$W$25,4,0)),A74+1,VLOOKUP(ROW(),$T$6:$W$25,4,0)))","v":{"$error":"#VALUE!"}},"",{"$f":"INDEX(MID(SheetNames,FIND(\"]\",SheetNames)+1,255),ROWS(A$4:$A$4))","v":"Publicização"},"","","","","","","","","","","","",""]
[{"$f":"IF(INDIRECT(ADDRESS(ROW()-1,COLUMN()))+1>ROW(INDIRECT(\"'\"&INDEX(MID(SheetNames,FIND(\"]\",SheetNames)+1,255),ROWS(A$4:$A$4))&\"'!\"&\"ProjectLastRow\"))-1,\"\",IF(ISERROR(VLOOKUP(ROW(),$T$6:$W$25,4,0)),A75+1,VLOOKUP(ROW(),$T$6:$W$25,4,0)))","v":{"$error":"#VALUE!"}},"",{"$f":"INDEX(MID(SheetNames,FIND(\"]\",SheetNames)+1,255),ROWS(A$4:$A$4))","v":"Publicização"},"","","","","","","","","","","","",""]
[{"$f":"IF(INDIRECT(ADDRESS(ROW()-1,COLUMN()))+1>ROW(INDIRECT(\"'\"&INDEX(MID(SheetNames,FIND(\"]\",SheetNames)+1,255),ROWS(A$4:$A$4))&\"'!\"&\"ProjectLastRow\"))-1,\"\",IF(ISERROR(VLOOKUP(ROW(),$T$6:$W$25,4,0)),A76+1,VLOOKUP(ROW(),$T$6:$W$25,4,0)))","v":{"$error":"#VALUE!"}},"",{"$f":"INDEX(MID(SheetNames,FIND(\"]\",SheetNames)+1,255),ROWS(A$4:$A$4))","v":"Publicização"},"","","","","","","","","","","","",""]
[{"$f":"IF(INDIRECT(ADDRESS(ROW()-1,COLUMN()))+1>ROW(INDIRECT(\"'\"&INDEX(MID(SheetNames,FIND(\"]\",SheetNames)+1,255),ROWS(A$4:$A$4))&\"'!\"&\"ProjectLastRow\"))-1,\"\",IF(ISERROR(VLOOKUP(ROW(),$T$6:$W$25,4,0)),A77+1,VLOOKUP(ROW(),$T$6:$W$25,4,0)))","v":{"$error":"#VALUE!"}},"",{"$f":"INDEX(MID(SheetNames,FIND(\"]\",SheetNames)+1,255),ROWS(A$4:$A$4))","v":"Publicização"},"","","","","","","","","","","","",""]
[{"$f":"IF(INDIRECT(ADDRESS(ROW()-1,COLUMN()))+1>ROW(INDIRECT(\"'\"&INDEX(MID(SheetNames,FIND(\"]\",SheetNames)+1,255),ROWS(A$4:$A$4))&\"'!\"&\"ProjectLastRow\"))-1,\"\",IF(ISERROR(VLOOKUP(ROW(),$T$6:$W$25,4,0)),A78+1,VLOOKUP(ROW(),$T$6:$W$25,4,0)))","v":{"$error":"#VALUE!"}},"",{"$f":"INDEX(MID(SheetNames,FIND(\"]\",SheetNames)+1,255),ROWS(A$4:$A$4))","v":"Publicização"},"","","","","","","","","","","","",""]
[{"$f":"IF(INDIRECT(ADDRESS(ROW()-1,COLUMN()))+1>ROW(INDIRECT(\"'\"&INDEX(MID(SheetNames,FIND(\"]\",SheetNames)+1,255),ROWS(A$4:$A$4))&\"'!\"&\"ProjectLastRow\"))-1,\"\",IF(ISERROR(VLOOKUP(ROW(),$T$6:$W$25,4,0)),A79+1,VLOOKUP(ROW(),$T$6:$W$25,4,0)))","v":{"$error":"#VALUE!"}},"",{"$f":"INDEX(MID(SheetNames,FIND(\"]\",SheetNames)+1,255),ROWS(A$4:$A$4))","v":"Publicização"},"","","","","","","","","","","","",""]
[{"$f":"IF(INDIRECT(ADDRESS(ROW()-1,COLUMN()))+1>ROW(INDIRECT(\"'\"&INDEX(MID(SheetNames,FIND(\"]\",SheetNames)+1,255),ROWS(A$4:$A$4))&\"'!\"&\"ProjectLastRow\"))-1,\"\",IF(ISERROR(VLOOKUP(ROW(),$T$6:$W$25,4,0)),A80+1,VLOOKUP(ROW(),$T$6:$W$25,4,0)))","v":{"$error":"#VALUE!"}},"",{"$f":"INDEX(MID(SheetNames,FIND(\"]\",SheetNames)+1,255),ROWS(A$4:$A$4))","v":"Publicização"},"","","","","","","","","","","","",""]
[{"$f":"IF(INDIRECT(ADDRESS(ROW()-1,COLUMN()))+1>ROW(INDIRECT(\"'\"&INDEX(MID(SheetNames,FIND(\"]\",SheetNames)+1,255),ROWS(A$4:$A$4))&\"'!\"&\"ProjectLastRow\"))-1,\"\",IF(ISERROR(VLOOKUP(ROW(),$T$6:$W$25,4,0)),A81+1,VLOOKUP(ROW(),$T$6:$W$25,4,0)))","v":{"$error":"#VALUE!"}},"",{"$f":"INDEX(MID(SheetNames,FIND(\"]\",SheetNames)+1,255),ROWS(A$4:$A$4))","v":"Publicização"},"","","","","","","","","","","","",""]
[{"$f":"IF(INDIRECT(ADDRESS(ROW()-1,COLUMN()))+1>ROW(INDIRECT(\"'\"&INDEX(MID(SheetNames,FIND(\"]\",SheetNames)+1,255),ROWS(A$4:$A$4))&\"'!\"&\"ProjectLastRow\"))-1,\"\",IF(ISERROR(VLOOKUP(ROW(),$T$6:$W$25,4,0)),A82+1,VLOOKUP(ROW(),$T$6:$W$25,4,0)))","v":{"$error":"#VALUE!"}},"",{"$f":"INDEX(MID(SheetNames,FIND(\"]\",SheetNames)+1,255),ROWS(A$4:$A$4))","v":"Publicização"},"","","","","","","","","","","","",""]
[{"$f":"IF(INDIRECT(ADDRESS(ROW()-1,COLUMN()))+1>ROW(INDIRECT(\"'\"&INDEX(MID(SheetNames,FIND(\"]\",SheetNames)+1,255),ROWS(A$4:$A$4))&\"'!\"&\"ProjectLastRow\"))-1,\"\",IF(ISERROR(VLOOKUP(ROW(),$T$6:$W$25,4,0)),A83+1,VLOOKUP(ROW(),$T$6:$W$25,4,0)))","v":{"$error":"#VALUE!"}},"",{"$f":"INDEX(MID(SheetNames,FIND(\"]\",SheetNames)+1,255),ROWS(A$4:$A$4))","v":"Publicização"},"","","","","","","","","","","","",""]
[{"$f":"IF(INDIRECT(ADDRESS(ROW()-1,COLUMN()))+1>ROW(INDIRECT(\"'\"&INDEX(MID(SheetNames,FIND(\"]\",SheetNames)+1,255),ROWS(A$4:$A$4))&\"'!\"&\"ProjectLastRow\"))-1,\"\",IF(ISERROR(VLOOKUP(ROW(),$T$6:$W$25,4,0)),A84+1,VLOOKUP(ROW(),$T$6:$W$25,4,0)))","v":{"$error":"#VALUE!"}},"",{"$f":"INDEX(MID(SheetNames,FIND(\"]\",SheetNames)+1,255),ROWS(A$4:$A$4))","v":"Publicização"},"","","","","","","","","","","","",""]
[{"$f":"IF(INDIRECT(ADDRESS(ROW()-1,COLUMN()))+1>ROW(INDIRECT(\"'\"&INDEX(MID(SheetNames,FIND(\"]\",SheetNames)+1,255),ROWS(A$4:$A$4))&\"'!\"&\"ProjectLastRow\"))-1,\"\",IF(ISERROR(VLOOKUP(ROW(),$T$6:$W$25,4,0)),A85+1,VLOOKUP(ROW(),$T$6:$W$25,4,0)))","v":{"$error":"#VALUE!"}},"",{"$f":"INDEX(MID(SheetNames,FIND(\"]\",SheetNames)+1,255),ROWS(A$4:$A$4))","v":"Publicização"},"","","","","","","","","","","","",""]
[{"$f":"IF(INDIRECT(ADDRESS(ROW()-1,COLUMN()))+1>ROW(INDIRECT(\"'\"&INDEX(MID(SheetNames,FIND(\"]\",SheetNames)+1,255),ROWS(A$4:$A$4))&\"'!\"&\"ProjectLastRow\"))-1,\"\",IF(ISERROR(VLOOKUP(ROW(),$T$6:$W$25,4,0)),A86+1,VLOOKUP(ROW(),$T$6:$W$25,4,0)))","v":{"$error":"#VALUE!"}},"",{"$f":"INDEX(MID(SheetNames,FIND(\"]\",SheetNames)+1,255),ROWS(A$4:$A$4))","v":"Publicização"},{"$f":"IF(OR(ISBLANK(INDIRECT(\"'\"&$C87&\"'!\"&D$4&$A87)),ISERROR(INDIRECT(\"'\"&$C87&\"'!\"&D$4&$A87))),\"\",INDIRECT(\"'\"&$C87&\"'!\"&D$4&$A87))","v":""},"","","","","","","","","","","",""]
[{"$f":"IF(INDIRECT(ADDRESS(ROW()-1,COLUMN()))+1>ROW(INDIRECT(\"'\"&INDEX(MID(SheetNames,FIND(\"]\",SheetNames)+1,255),ROWS(A$4:$A$4))&\"'!\"&\"ProjectLastRow\"))-1,\"\",IF(ISERROR(VLOOKUP(ROW(),$T$6:$W$25,4,0)),A87+1,VLOOKUP(ROW(),$T$6:$W$25,4,0)))","v":{"$error":"#VALUE!"}},"",{"$f":"INDEX(MID(SheetNames,FIND(\"]\",SheetNames)+1,255),ROWS(A$4:$A$4))","v":"Publicização"},"","","","","","","","","","","","",""]
[{"$f":"IF(INDIRECT(ADDRESS(ROW()-1,COLUMN()))+1>ROW(INDIRECT(\"'\"&INDEX(MID(SheetNames,FIND(\"]\",SheetNames)+1,255),ROWS(A$4:$A$4))&\"'!\"&\"ProjectLastRow\"))-1,\"\",IF(ISERROR(VLOOKUP(ROW(),$T$6:$W$25,4,0)),A88+1,VLOOKUP(ROW(),$T$6:$W$25,4,0)))","v":{"$error":"#VALUE!"}},"",{"$f":"INDEX(MID(SheetNames,FIND(\"]\",SheetNames)+1,255),ROWS(A$4:$A$4))","v":"Publicização"},"","","","","","","","","","","","",""]
[{"$f":"IF(INDIRECT(ADDRESS(ROW()-1,COLUMN()))+1>ROW(INDIRECT(\"'\"&INDEX(MID(SheetNames,FIND(\"]\",SheetNames)+1,255),ROWS(A$4:$A$4))&\"'!\"&\"ProjectLastRow\"))-1,\"\",IF(ISERROR(VLOOKUP(ROW(),$T$6:$W$25,4,0)),A89+1,VLOOKUP(ROW(),$T$6:$W$25,4,0)))","v":{"$error":"#VALUE!"}},"",{"$f":"INDEX(MID(SheetNames,FIND(\"]\",SheetNames)+1,255),ROWS(A$4:$A$4))","v":"Publicização"},"","","","","","","","","","","","",""]
[{"$f":"IF(INDIRECT(ADDRESS(ROW()-1,COLUMN()))+1>ROW(INDIRECT(\"'\"&INDEX(MID(SheetNames,FIND(\"]\",SheetNames)+1,255),ROWS(A$4:$A$4))&\"'!\"&\"ProjectLastRow\"))-1,\"\",IF(ISERROR(VLOOKUP(ROW(),$T$6:$W$25,4,0)),A90+1,VLOOKUP(ROW(),$T$6:$W$25,4,0)))","v":{"$error":"#VALUE!"}},"",{"$f":"INDEX(MID(SheetNames,FIND(\"]\",SheetNames)+1,255),ROWS(A$4:$A$4))","v":"Publicização"},"","","","","","","","","","","","",""]
[{"$f":"IF(INDIRECT(ADDRESS(ROW()-1,COLUMN()))+1>ROW(INDIRECT(\"'\"&INDEX(MID(SheetNames,FIND(\"]\",SheetNames)+1,255),ROWS(A$4:$A$4))&\"'!\"&\"ProjectLastRow\"))-1,\"\",IF(ISERROR(VLOOKUP(ROW(),$T$6:$W$25,4,0)),A91+1,VLOOKUP(ROW(),$T$6:$W$25,4,0)))","v":{"$error":"#VALUE!"}},"",{"$f":"INDEX(MID(SheetNames,FIND(\"]\",SheetNames)+1,255),ROWS(A$4:$A$4))","v":"Publicização"},"","","","","","","","","","","","",""]
[{"$f":"IF(INDIRECT(ADDRESS(ROW()-1,COLUMN()))+1>ROW(INDIRECT(\"'\"&INDEX(MID(SheetNames,FIND(\"]\",SheetNames)+1,255),ROWS(A$4:$A$4))&\"'!\"&\"ProjectLastRow\"))-1,\"\",IF(ISERROR(VLOOKUP(ROW(),$T$6:$W$25,4,0)),A92+1,VLOOKUP(ROW(),$T$6:$W$25,4,0)))","v":{"$error":"#VALUE!"}},"",{"$f":"INDEX(MID(SheetNames,FIND(\"]\",SheetNames)+1,255),ROWS(A$4:$A$4))","v":"Publicização"},"","","","","","","","","","","","",""]
[{"$f":"IF(INDIRECT(ADDRESS(ROW()-1,COLUMN()))+1>ROW(INDIRECT(\"'\"&INDEX(MID(SheetNames,FIND(\"]\",SheetNames)+1,255),ROWS(A$4:$A$4))&\"'!\"&\"ProjectLastRow\"))-1,\"\",IF(ISERROR(VLOOKUP(ROW(),$T$6:$W$25,4,0)),A93+1,VLOOKUP(ROW(),$T$6:$W$25,4,0)))","v":{"$error":"#VALUE!"}},"",{"$f":"INDEX(MID(SheetNames,FIND(\"]\",SheetNames)+1,255),ROWS(A$4:$A$4))","v":"Publicização"},"","","","","","","","","","","","",""]
[{"$f":"IF(INDIRECT(ADDRESS(ROW()-1,COLUMN()))+1>ROW(INDIRECT(\"'\"&INDEX(MID(SheetNames,FIND(\"]\",SheetNames)+1,255),ROWS(A$4:$A$4))&\"'!\"&\"ProjectLastRow\"))-1,\"\",IF(ISERROR(VLOOKUP(ROW(),$T$6:$W$25,4,0)),A94+1,VLOOKUP(ROW(),$T$6:$W$25,4,0)))","v":{"$error":"#VALUE!"}},"",{"$f":"INDEX(MID(SheetNames,FIND(\"]\",SheetNames)+1,255),ROWS(A$4:$A$4))","v":"Publicização"},"","","","","","","","","","","","",""]
[{"$f":"IF(INDIRECT(ADDRESS(ROW()-1,COLUMN()))+1>ROW(INDIRECT(\"'\"&INDEX(MID(SheetNames,FIND(\"]\",SheetNames)+1,255),ROWS(A$4:$A$4))&\"'!\"&\"ProjectLastRow\"))-1,\"\",IF(ISERROR(VLOOKUP(ROW(),$T$6:$W$25,4,0)),A95+1,VLOOKUP(ROW(),$T$6:$W$25,4,0)))","v":{"$error":"#VALUE!"}},"",{"$f":"INDEX(MID(SheetNames,FIND(\"]\",SheetNames)+1,255),ROWS(A$4:$A$4))","v":"Publicização"},"","","","","","","","","","","","",""]
[{"$f":"IF(INDIRECT(ADDRESS(ROW()-1,COLUMN()))+1>ROW(INDIRECT(\"'\"&INDEX(MID(SheetNames,FIND(\"]\",SheetNames)+1,255),ROWS(A$4:$A$4))&\"'!\"&\"ProjectLastRow\"))-1,\"\",IF(ISERROR(VLOOKUP(ROW(),$T$6:$W$25,4,0)),A96+1,VLOOKUP(ROW(),$T$6:$W$25,4,0)))","v":{"$error":"#VALUE!"}},"",{"$f":"INDEX(MID(SheetNames,FIND(\"]\",SheetNames)+1,255),ROWS(A$4:$A$4))","v":"Publicização"},"","","","","","","","","","","","",""]
[{"$f":"IF(INDIRECT(ADDRESS(ROW()-1,COLUMN()))+1>ROW(INDIRECT(\"'\"&INDEX(MID(SheetNames,FIND(\"]\",SheetNames)+1,255),ROWS(A$4:$A$4))&\"'!\"&\"ProjectLastRow\"))-1,\"\",IF(ISERROR(VLOOKUP(ROW(),$T$6:$W$25,4,0)),A97+1,VLOOKUP(ROW(),$T$6:$W$25,4,0)))","v":{"$error":"#VALUE!"}},"",{"$f":"INDEX(MID(SheetNames,FIND(\"]\",SheetNames)+1,255),ROWS(A$4:$A$4))","v":"Publicização"},"","","","","","","","","","","","",""]
[{"$f":"IF(INDIRECT(ADDRESS(ROW()-1,COLUMN()))+1>ROW(INDIRECT(\"'\"&INDEX(MID(SheetNames,FIND(\"]\",SheetNames)+1,255),ROWS(A$4:$A$4))&\"'!\"&\"ProjectLastRow\"))-1,\"\",IF(ISERROR(VLOOKUP(ROW(),$T$6:$W$25,4,0)),A98+1,VLOOKUP(ROW(),$T$6:$W$25,4,0)))","v":{"$error":"#VALUE!"}},"",{"$f":"INDEX(MID(SheetNames,FIND(\"]\",SheetNames)+1,255),ROWS(A$4:$A$4))","v":"Publicização"},"","","","","","","","","","","","",""]
[{"$f":"IF(INDIRECT(ADDRESS(ROW()-1,COLUMN()))+1>ROW(INDIRECT(\"'\"&INDEX(MID(SheetNames,FIND(\"]\",SheetNames)+1,255),ROWS(A$4:$A$4))&\"'!\"&\"ProjectLastRow\"))-1,\"\",IF(ISERROR(VLOOKUP(ROW(),$T$6:$W$25,4,0)),A99+1,VLOOKUP(ROW(),$T$6:$W$25,4,0)))","v":{"$error":"#VALUE!"}},"",{"$f":"INDEX(MID(SheetNames,FIND(\"]\",SheetNames)+1,255),ROWS(A$4:$A$4))","v":"Publicização"},"","","","","","","","","","","","",""]
[{"$f":"IF(INDIRECT(ADDRESS(ROW()-1,COLUMN()))+1>ROW(INDIRECT(\"'\"&INDEX(MID(SheetNames,FIND(\"]\",SheetNames)+1,255),ROWS(A$4:$A$4))&\"'!\"&\"ProjectLastRow\"))-1,\"\",IF(ISERROR(VLOOKUP(ROW(),$T$6:$W$25,4,0)),A100+1,VLOOKUP(ROW(),$T$6:$W$25,4,0)))","v":{"$error":"#VALUE!"}},"",{"$f":"INDEX(MID(SheetNames,FIND(\"]\",SheetNames)+1,255),ROWS(A$4:$A$4))","v":"Publicização"},"","","","","","","","","","","","",""]
[{"$f":"IF(INDIRECT(ADDRESS(ROW()-1,COLUMN()))+1>ROW(INDIRECT(\"'\"&INDEX(MID(SheetNames,FIND(\"]\",SheetNames)+1,255),ROWS(A$4:$A$4))&\"'!\"&\"ProjectLastRow\"))-1,\"\",IF(ISERROR(VLOOKUP(ROW(),$T$6:$W$25,4,0)),A101+1,VLOOKUP(ROW(),$T$6:$W$25,4,0)))","v":{"$error":"#VALUE!"}},"",{"$f":"INDEX(MID(SheetNames,FIND(\"]\",SheetNames)+1,255),ROWS(A$4:$A$4))","v":"Publicização"},"","","","","","","","","","","","",""]
[{"$f":"IF(INDIRECT(ADDRESS(ROW()-1,COLUMN()))+1>ROW(INDIRECT(\"'\"&INDEX(MID(SheetNames,FIND(\"]\",SheetNames)+1,255),ROWS(A$4:$A$4))&\"'!\"&\"ProjectLastRow\"))-1,\"\",IF(ISERROR(VLOOKUP(ROW(),$T$6:$W$25,4,0)),A102+1,VLOOKUP(ROW(),$T$6:$W$25,4,0)))","v":{"$error":"#VALUE!"}},"",{"$f":"INDEX(MID(SheetNames,FIND(\"]\",SheetNames)+1,255),ROWS(A$4:$A$4))","v":"Publicização"},{"$f":"IF(OR(ISBLANK(INDIRECT(\"'\"&$C103&\"'!\"&D$4&$A103)),ISERROR(INDIRECT(\"'\"&$C103&\"'!\"&D$4&$A103))),\"\",INDIRECT(\"'\"&$C103&\"'!\"&D$4&$A103))","v":""},"","","","","","","","","","","",""]
[{"$f":"IF(INDIRECT(ADDRESS(ROW()-1,COLUMN()))+1>ROW(INDIRECT(\"'\"&INDEX(MID(SheetNames,FIND(\"]\",SheetNames)+1,255),ROWS(A$4:$A$4))&\"'!\"&\"ProjectLastRow\"))-1,\"\",IF(ISERROR(VLOOKUP(ROW(),$T$6:$W$25,4,0)),A103+1,VLOOKUP(ROW(),$T$6:$W$25,4,0)))","v":{"$error":"#VALUE!"}},"",{"$f":"INDEX(MID(SheetNames,FIND(\"]\",SheetNames)+1,255),ROWS(A$4:$A$4))","v":"Publicização"},"","","","","","","","","","","","",""]
[{"$f":"IF(INDIRECT(ADDRESS(ROW()-1,COLUMN()))+1>ROW(INDIRECT(\"'\"&INDEX(MID(SheetNames,FIND(\"]\",SheetNames)+1,255),ROWS(A$4:$A$4))&\"'!\"&\"ProjectLastRow\"))-1,\"\",IF(ISERROR(VLOOKUP(ROW(),$T$6:$W$25,4,0)),A104+1,VLOOKUP(ROW(),$T$6:$W$25,4,0)))","v":{"$error":"#VALUE!"}},"",{"$f":"INDEX(MID(SheetNames,FIND(\"]\",SheetNames)+1,255),ROWS(A$4:$A$4))","v":"Publicização"},"","","","","","","","","","","","",""]
[{"$f":"IF(INDIRECT(ADDRESS(ROW()-1,COLUMN()))+1>ROW(INDIRECT(\"'\"&INDEX(MID(SheetNames,FIND(\"]\",SheetNames)+1,255),ROWS(A$4:$A$4))&\"'!\"&\"ProjectLastRow\"))-1,\"\",IF(ISERROR(VLOOKUP(ROW(),$T$6:$W$25,4,0)),A105+1,VLOOKUP(ROW(),$T$6:$W$25,4,0)))","v":{"$error":"#VALUE!"}},"",{"$f":"INDEX(MID(SheetNames,FIND(\"]\",SheetNames)+1,255),ROWS(A$4:$A$4))","v":"Publicização"},"","","","","","","","","","","","",""]
[{"$f":"IF(INDIRECT(ADDRESS(ROW()-1,COLUMN()))+1>ROW(INDIRECT(\"'\"&INDEX(MID(SheetNames,FIND(\"]\",SheetNames)+1,255),ROWS(A$4:$A$4))&\"'!\"&\"ProjectLastRow\"))-1,\"\",IF(ISERROR(VLOOKUP(ROW(),$T$6:$W$25,4,0)),A106+1,VLOOKUP(ROW(),$T$6:$W$25,4,0)))","v":{"$error":"#VALUE!"}},"",{"$f":"INDEX(MID(SheetNames,FIND(\"]\",SheetNames)+1,255),ROWS(A$4:$A$4))","v":"Publicização"},"","","","","","","","","","","","",""]
[{"$f":"IF(INDIRECT(ADDRESS(ROW()-1,COLUMN()))+1>ROW(INDIRECT(\"'\"&INDEX(MID(SheetNames,FIND(\"]\",SheetNames)+1,255),ROWS(A$4:$A$4))&\"'!\"&\"ProjectLastRow\"))-1,\"\",IF(ISERROR(VLOOKUP(ROW(),$T$6:$W$25,4,0)),A107+1,VLOOKUP(ROW(),$T$6:$W$25,4,0)))","v":{"$error":"#VALUE!"}},"",{"$f":"INDEX(MID(SheetNames,FIND(\"]\",SheetNames)+1,255),ROWS(A$4:$A$4))","v":"Publicização"},"","","","","","","","","","","","",""]
[{"$f":"IF(INDIRECT(ADDRESS(ROW()-1,COLUMN()))+1>ROW(INDIRECT(\"'\"&INDEX(MID(SheetNames,FIND(\"]\",SheetNames)+1,255),ROWS(A$4:$A$4))&\"'!\"&\"ProjectLastRow\"))-1,\"\",IF(ISERROR(VLOOKUP(ROW(),$T$6:$W$25,4,0)),A108+1,VLOOKUP(ROW(),$T$6:$W$25,4,0)))","v":{"$error":"#VALUE!"}},"",{"$f":"INDEX(MID(SheetNames,FIND(\"]\",SheetNames)+1,255),ROWS(A$4:$A$4))","v":"Publicização"},"","","","","","","","","","","","",""]
[{"$f":"IF(INDIRECT(ADDRESS(ROW()-1,COLUMN()))+1>ROW(INDIRECT(\"'\"&INDEX(MID(SheetNames,FIND(\"]\",SheetNames)+1,255),ROWS(A$4:$A$4))&\"'!\"&\"ProjectLastRow\"))-1,\"\",IF(ISERROR(VLOOKUP(ROW(),$T$6:$W$25,4,0)),A109+1,VLOOKUP(ROW(),$T$6:$W$25,4,0)))","v":{"$error":"#VALUE!"}},"",{"$f":"INDEX(MID(SheetNames,FIND(\"]\",SheetNames)+1,255),ROWS(A$4:$A$4))","v":"Publicização"},"","","","","","","","","","","","",""]
[{"$f":"IF(INDIRECT(ADDRESS(ROW()-1,COLUMN()))+1>ROW(INDIRECT(\"'\"&INDEX(MID(SheetNames,FIND(\"]\",SheetNames)+1,255),ROWS(A$4:$A$4))&\"'!\"&\"ProjectLastRow\"))-1,\"\",IF(ISERROR(VLOOKUP(ROW(),$T$6:$W$25,4,0)),A110+1,VLOOKUP(ROW(),$T$6:$W$25,4,0)))","v":{"$error":"#VALUE!"}},"",{"$f":"INDEX(MID(SheetNames,FIND(\"]\",SheetNames)+1,255),ROWS(A$4:$A$4))","v":"Publicização"},"","","","","","","","","","","","",""]
[{"$f":"IF(INDIRECT(ADDRESS(ROW()-1,COLUMN()))+1>ROW(INDIRECT(\"'\"&INDEX(MID(SheetNames,FIND(\"]\",SheetNames)+1,255),ROWS(A$4:$A$4))&\"'!\"&\"ProjectLastRow\"))-1,\"\",IF(ISERROR(VLOOKUP(ROW(),$T$6:$W$25,4,0)),A111+1,VLOOKUP(ROW(),$T$6:$W$25,4,0)))","v":{"$error":"#VALUE!"}},"",{"$f":"INDEX(MID(SheetNames,FIND(\"]\",SheetNames)+1,255),ROWS(A$4:$A$4))","v":"Publicização"},"","","","","","","","","","","","",""]
[{"$f":"IF(INDIRECT(ADDRESS(ROW()-1,COLUMN()))+1>ROW(INDIRECT(\"'\"&INDEX(MID(SheetNames,FIND(\"]\",SheetNames)+1,255),ROWS(A$4:$A$4))&\"'!\"&\"ProjectLastRow\"))-1,\"\",IF(ISERROR(VLOOKUP(ROW(),$T$6:$W$25,4,0)),A112+1,VLOOKUP(ROW(),$T$6:$W$25,4,0)))","v":{"$error":"#VALUE!"}},"",{"$f":"INDEX(MID(SheetNames,FIND(\"]\",SheetNames)+1,255),ROWS(A$4:$A$4))","v":"Publicização"},"","","","","","","","","","","","",""]
[{"$f":"IF(INDIRECT(ADDRESS(ROW()-1,COLUMN()))+1>ROW(INDIRECT(\"'\"&INDEX(MID(SheetNames,FIND(\"]\",SheetNames)+1,255),ROWS(A$4:$A$4))&\"'!\"&\"ProjectLastRow\"))-1,\"\",IF(ISERROR(VLOOKUP(ROW(),$T$6:$W$25,4,0)),A113+1,VLOOKUP(ROW(),$T$6:$W$25,4,0)))","v":{"$error":"#VALUE!"}},"",{"$f":"INDEX(MID(SheetNames,FIND(\"]\",SheetNames)+1,255),ROWS(A$4:$A$4))","v":"Publicização"},"","","","","","","","","","","","",""]
[{"$f":"IF(INDIRECT(ADDRESS(ROW()-1,COLUMN()))+1>ROW(INDIRECT(\"'\"&INDEX(MID(SheetNames,FIND(\"]\",SheetNames)+1,255),ROWS(A$4:$A$4))&\"'!\"&\"ProjectLastRow\"))-1,\"\",IF(ISERROR(VLOOKUP(ROW(),$T$6:$W$25,4,0)),A114+1,VLOOKUP(ROW(),$T$6:$W$25,4,0)))","v":{"$error":"#VALUE!"}},"",{"$f":"INDEX(MID(SheetNames,FIND(\"]\",SheetNames)+1,255),ROWS(A$4:$A$4))","v":"Publicização"},"","","","","","","","","","","","",""]
[{"$f":"IF(INDIRECT(ADDRESS(ROW()-1,COLUMN()))+1>ROW(INDIRECT(\"'\"&INDEX(MID(SheetNames,FIND(\"]\",SheetNames)+1,255),ROWS(A$4:$A$4))&\"'!\"&\"ProjectLastRow\"))-1,\"\",IF(ISERROR(VLOOKUP(ROW(),$T$6:$W$25,4,0)),A115+1,VLOOKUP(ROW(),$T$6:$W$25,4,0)))","v":{"$error":"#VALUE!"}},"",{"$f":"INDEX(MID(SheetNames,FIND(\"]\",SheetNames)+1,255),ROWS(A$4:$A$4))","v":"Publicização"},"","","","","","","","","","","","",""]
[{"$f":"IF(INDIRECT(ADDRESS(ROW()-1,COLUMN()))+1>ROW(INDIRECT(\"'\"&INDEX(MID(SheetNames,FIND(\"]\",SheetNames)+1,255),ROWS(A$4:$A$4))&\"'!\"&\"ProjectLastRow\"))-1,\"\",IF(ISERROR(VLOOKUP(ROW(),$T$6:$W$25,4,0)),A116+1,VLOOKUP(ROW(),$T$6:$W$25,4,0)))","v":{"$error":"#VALUE!"}},"",{"$f":"INDEX(MID(SheetNames,FIND(\"]\",SheetNames)+1,255),ROWS(A$4:$A$4))","v":"Publicização"},"","","","","","","","","","","","",""]
[{"$f":"IF(INDIRECT(ADDRESS(ROW()-1,COLUMN()))+1>ROW(INDIRECT(\"'\"&INDEX(MID(SheetNames,FIND(\"]\",SheetNames)+1,255),ROWS(A$4:$A$4))&\"'!\"&\"ProjectLastRow\"))-1,\"\",IF(ISERROR(VLOOKUP(ROW(),$T$6:$W$25,4,0)),A117+1,VLOOKUP(ROW(),$T$6:$W$25,4,0)))","v":{"$error":"#VALUE!"}},"",{"$f":"INDEX(MID(SheetNames,FIND(\"]\",SheetNames)+1,255),ROWS(A$4:$A$4))","v":"Publicização"},"","","","","","","","","","","","",""]
[{"$f":"IF(INDIRECT(ADDRESS(ROW()-1,COLUMN()))+1>ROW(INDIRECT(\"'\"&INDEX(MID(SheetNames,FIND(\"]\",SheetNames)+1,255),ROWS(A$4:$A$4))&\"'!\"&\"ProjectLastRow\"))-1,\"\",IF(ISERROR(VLOOKUP(ROW(),$T$6:$W$25,4,0)),A118+1,VLOOKUP(ROW(),$T$6:$W$25,4,0)))","v":{"$error":"#VALUE!"}},"",{"$f":"INDEX(MID(SheetNames,FIND(\"]\",SheetNames)+1,255),ROWS(A$4:$A$4))","v":"Publicização"},{"$f":"IF(OR(ISBLANK(INDIRECT(\"'\"&$C119&\"'!\"&D$4&$A119)),ISERROR(INDIRECT(\"'\"&$C119&\"'!\"&D$4&$A119))),\"\",INDIRECT(\"'\"&$C119&\"'!\"&D$4&$A119))","v":""},"","","","","","","","","","","",""]
[{"$f":"IF(INDIRECT(ADDRESS(ROW()-1,COLUMN()))+1>ROW(INDIRECT(\"'\"&INDEX(MID(SheetNames,FIND(\"]\",SheetNames)+1,255),ROWS(A$4:$A$4))&\"'!\"&\"ProjectLastRow\"))-1,\"\",IF(ISERROR(VLOOKUP(ROW(),$T$6:$W$25,4,0)),A119+1,VLOOKUP(ROW(),$T$6:$W$25,4,0)))","v":{"$error":"#VALUE!"}},"",{"$f":"INDEX(MID(SheetNames,FIND(\"]\",SheetNames)+1,255),ROWS(A$4:$A$4))","v":"Publicização"},"","","","","","","","","","","","",""]
[{"$f":"IF(INDIRECT(ADDRESS(ROW()-1,COLUMN()))+1>ROW(INDIRECT(\"'\"&INDEX(MID(SheetNames,FIND(\"]\",SheetNames)+1,255),ROWS(A$4:$A$4))&\"'!\"&\"ProjectLastRow\"))-1,\"\",IF(ISERROR(VLOOKUP(ROW(),$T$6:$W$25,4,0)),A120+1,VLOOKUP(ROW(),$T$6:$W$25,4,0)))","v":{"$error":"#VALUE!"}},"",{"$f":"INDEX(MID(SheetNames,FIND(\"]\",SheetNames)+1,255),ROWS(A$4:$A$4))","v":"Publicização"},"","","","","","","","","","","","",""]
[{"$f":"IF(INDIRECT(ADDRESS(ROW()-1,COLUMN()))+1>ROW(INDIRECT(\"'\"&INDEX(MID(SheetNames,FIND(\"]\",SheetNames)+1,255),ROWS(A$4:$A$4))&\"'!\"&\"ProjectLastRow\"))-1,\"\",IF(ISERROR(VLOOKUP(ROW(),$T$6:$W$25,4,0)),A121+1,VLOOKUP(ROW(),$T$6:$W$25,4,0)))","v":{"$error":"#VALUE!"}},"",{"$f":"INDEX(MID(SheetNames,FIND(\"]\",SheetNames)+1,255),ROWS(A$4:$A$4))","v":"Publicização"},"","","","","","","","","","","","",""]
[{"$f":"IF(INDIRECT(ADDRESS(ROW()-1,COLUMN()))+1>ROW(INDIRECT(\"'\"&INDEX(MID(SheetNames,FIND(\"]\",SheetNames)+1,255),ROWS(A$4:$A$4))&\"'!\"&\"ProjectLastRow\"))-1,\"\",IF(ISERROR(VLOOKUP(ROW(),$T$6:$W$25,4,0)),A122+1,VLOOKUP(ROW(),$T$6:$W$25,4,0)))","v":{"$error":"#VALUE!"}},"",{"$f":"INDEX(MID(SheetNames,FIND(\"]\",SheetNames)+1,255),ROWS(A$4:$A$4))","v":"Publicização"},"","","","","","","","","","","","",""]
[{"$f":"IF(INDIRECT(ADDRESS(ROW()-1,COLUMN()))+1>ROW(INDIRECT(\"'\"&INDEX(MID(SheetNames,FIND(\"]\",SheetNames)+1,255),ROWS(A$4:$A$4))&\"'!\"&\"ProjectLastRow\"))-1,\"\",IF(ISERROR(VLOOKUP(ROW(),$T$6:$W$25,4,0)),A123+1,VLOOKUP(ROW(),$T$6:$W$25,4,0)))","v":{"$error":"#VALUE!"}},"",{"$f":"INDEX(MID(SheetNames,FIND(\"]\",SheetNames)+1,255),ROWS(A$4:$A$4))","v":"Publicização"},"","","","","","","","","","","","",""]
[{"$f":"IF(INDIRECT(ADDRESS(ROW()-1,COLUMN()))+1>ROW(INDIRECT(\"'\"&INDEX(MID(SheetNames,FIND(\"]\",SheetNames)+1,255),ROWS(A$4:$A$4))&\"'!\"&\"ProjectLastRow\"))-1,\"\",IF(ISERROR(VLOOKUP(ROW(),$T$6:$W$25,4,0)),A124+1,VLOOKUP(ROW(),$T$6:$W$25,4,0)))","v":{"$error":"#VALUE!"}},"",{"$f":"INDEX(MID(SheetNames,FIND(\"]\",SheetNames)+1,255),ROWS(A$4:$A$4))","v":"Publicização"},"","","","","","","","","","","","",""]
[{"$f":"IF(INDIRECT(ADDRESS(ROW()-1,COLUMN()))+1>ROW(INDIRECT(\"'\"&INDEX(MID(SheetNames,FIND(\"]\",SheetNames)+1,255),ROWS(A$4:$A$4))&\"'!\"&\"ProjectLastRow\"))-1,\"\",IF(ISERROR(VLOOKUP(ROW(),$T$6:$W$25,4,0)),A125+1,VLOOKUP(ROW(),$T$6:$W$25,4,0)))","v":{"$error":"#VALUE!"}},"",{"$f":"INDEX(MID(SheetNames,FIND(\"]\",SheetNames)+1,255),ROWS(A$4:$A$4))","v":"Publicização"},"","","","","","","","","","","","",""]
[{"$f":"IF(INDIRECT(ADDRESS(ROW()-1,COLUMN()))+1>ROW(INDIRECT(\"'\"&INDEX(MID(SheetNames,FIND(\"]\",SheetNames)+1,255),ROWS(A$4:$A$4))&\"'!\"&\"ProjectLastRow\"))-1,\"\",IF(ISERROR(VLOOKUP(ROW(),$T$6:$W$25,4,0)),A126+1,VLOOKUP(ROW(),$T$6:$W$25,4,0)))","v":{"$error":"#VALUE!"}},"",{"$f":"INDEX(MID(SheetNames,FIND(\"]\",SheetNames)+1,255),ROWS(A$4:$A$4))","v":"Publicização"},"","","","","","","","","","","","",""]
[{"$f":"IF(INDIRECT(ADDRESS(ROW()-1,COLUMN()))+1>ROW(INDIRECT(\"'\"&INDEX(MID(SheetNames,FIND(\"]\",SheetNames)+1,255),ROWS(A$4:$A$4))&\"'!\"&\"ProjectLastRow\"))-1,\"\",IF(ISERROR(VLOOKUP(ROW(),$T$6:$W$25,4,0)),A127+1,VLOOKUP(ROW(),$T$6:$W$25,4,0)))","v":{"$error":"#VALUE!"}},"",{"$f":"INDEX(MID(SheetNames,FIND(\"]\",SheetNames)+1,255),ROWS(A$4:$A$4))","v":"Publicização"},"","","","","","","","","","","","",""]
[{"$f":"IF(INDIRECT(ADDRESS(ROW()-1,COLUMN()))+1>ROW(INDIRECT(\"'\"&INDEX(MID(SheetNames,FIND(\"]\",SheetNames)+1,255),ROWS(A$4:$A$4))&\"'!\"&\"ProjectLastRow\"))-1,\"\",IF(ISERROR(VLOOKUP(ROW(),$T$6:$W$25,4,0)),A128+1,VLOOKUP(ROW(),$T$6:$W$25,4,0)))","v":{"$error":"#VALUE!"}},"",{"$f":"INDEX(MID(SheetNames,FIND(\"]\",SheetNames)+1,255),ROWS(A$4:$A$4))","v":"Publicização"},"","","","","","","","","","","","",""]
[{"$f":"IF(INDIRECT(ADDRESS(ROW()-1,COLUMN()))+1>ROW(INDIRECT(\"'\"&INDEX(MID(SheetNames,FIND(\"]\",SheetNames)+1,255),ROWS(A$4:$A$4))&\"'!\"&\"ProjectLastRow\"))-1,\"\",IF(ISERROR(VLOOKUP(ROW(),$T$6:$W$25,4,0)),A129+1,VLOOKUP(ROW(),$T$6:$W$25,4,0)))","v":{"$error":"#VALUE!"}},"",{"$f":"INDEX(MID(SheetNames,FIND(\"]\",SheetNames)+1,255),ROWS(A$4:$A$4))","v":"Publicização"},"","","","","","","","","","","","",""]
[{"$f":"IF(INDIRECT(ADDRESS(ROW()-1,COLUMN()))+1>ROW(INDIRECT(\"'\"&INDEX(MID(SheetNames,FIND(\"]\",SheetNames)+1,255),ROWS(A$4:$A$4))&\"'!\"&\"ProjectLastRow\"))-1,\"\",IF(ISERROR(VLOOKUP(ROW(),$T$6:$W$25,4,0)),A130+1,VLOOKUP(ROW(),$T$6:$W$25,4,0)))","v":{"$error":"#VALUE!"}},"",{"$f":"INDEX(MID(SheetNames,FIND(\"]\",SheetNames)+1,255),ROWS(A$4:$A$4))","v":"Publicização"},"","","","","","","","","","","","",""]
[{"$f":"IF(INDIRECT(ADDRESS(ROW()-1,COLUMN()))+1>ROW(INDIRECT(\"'\"&INDEX(MID(SheetNames,FIND(\"]\",SheetNames)+1,255),ROWS(A$4:$A$4))&\"'!\"&\"ProjectLastRow\"))-1,\"\",IF(ISERROR(VLOOKUP(ROW(),$T$6:$W$25,4,0)),A131+1,VLOOKUP(ROW(),$T$6:$W$25,4,0)))","v":{"$error":"#VALUE!"}},"",{"$f":"INDEX(MID(SheetNames,FIND(\"]\",SheetNames)+1,255),ROWS(A$4:$A$4))","v":"Publicização"},"","","","","","","","","","","","",""]
[{"$f":"IF(INDIRECT(ADDRESS(ROW()-1,COLUMN()))+1>ROW(INDIRECT(\"'\"&INDEX(MID(SheetNames,FIND(\"]\",SheetNames)+1,255),ROWS(A$4:$A$4))&\"'!\"&\"ProjectLastRow\"))-1,\"\",IF(ISERROR(VLOOKUP(ROW(),$T$6:$W$25,4,0)),A132+1,VLOOKUP(ROW(),$T$6:$W$25,4,0)))","v":{"$error":"#VALUE!"}},"",{"$f":"INDEX(MID(SheetNames,FIND(\"]\",SheetNames)+1,255),ROWS(A$4:$A$4))","v":"Publicização"},"","","","","","","","","","","","",""]
[{"$f":"IF(INDIRECT(ADDRESS(ROW()-1,COLUMN()))+1>ROW(INDIRECT(\"'\"&INDEX(MID(SheetNames,FIND(\"]\",SheetNames)+1,255),ROWS(A$4:$A$4))&\"'!\"&\"ProjectLastRow\"))-1,\"\",IF(ISERROR(VLOOKUP(ROW(),$T$6:$W$25,4,0)),A133+1,VLOOKUP(ROW(),$T$6:$W$25,4,0)))","v":{"$error":"#VALUE!"}},"",{"$f":"INDEX(MID(SheetNames,FIND(\"]\",SheetNames)+1,255),ROWS(A$4:$A$4))","v":"Publicização"},"","","","","","","","","","","","",""]
[{"$f":"IF(INDIRECT(ADDRESS(ROW()-1,COLUMN()))+1>ROW(INDIRECT(\"'\"&INDEX(MID(SheetNames,FIND(\"]\",SheetNames)+1,255),ROWS(A$4:$A$4))&\"'!\"&\"ProjectLastRow\"))-1,\"\",IF(ISERROR(VLOOKUP(ROW(),$T$6:$W$25,4,0)),A134+1,VLOOKUP(ROW(),$T$6:$W$25,4,0)))","v":{"$error":"#VALUE!"}},{"$f":"IF(D135=\"\",\"\",C135&\"_\"&E135)","v":""},{"$f":"INDEX(MID(SheetNames,FIND(\"]\",SheetNames)+1,255),ROWS(A$4:$A$4))","v":"Publicização"},{"$f":"IF(OR(ISBLANK(INDIRECT(\"'\"&$C135&\"'!\"&D$4&$A135)),ISERROR(INDIRECT(\"'\"&$C135&\"'!\"&D$4&$A135))),\"\",INDIRECT(\"'\"&$C135&\"'!\"&D$4&$A135))","v":""},"","","","","","","","","","","",""]
[{"$f":"IF(INDIRECT(ADDRESS(ROW()-1,COLUMN()))+1>ROW(INDIRECT(\"'\"&INDEX(MID(SheetNames,FIND(\"]\",SheetNames)+1,255),ROWS(A$4:$A$4))&\"'!\"&\"ProjectLastRow\"))-1,\"\",IF(ISERROR(VLOOKUP(ROW(),$T$6:$W$25,4,0)),A135+1,VLOOKUP(ROW(),$T$6:$W$25,4,0)))","v":{"$error":"#VALUE!"}},"",{"$f":"INDEX(MID(SheetNames,FIND(\"]\",SheetNames)+1,255),ROWS(A$4:$A$4))","v":"Publicização"},"","","","","","","","","","","","",""]
[{"$f":"IF(INDIRECT(ADDRESS(ROW()-1,COLUMN()))+1>ROW(INDIRECT(\"'\"&INDEX(MID(SheetNames,FIND(\"]\",SheetNames)+1,255),ROWS(A$4:$A$4))&\"'!\"&\"ProjectLastRow\"))-1,\"\",IF(ISERROR(VLOOKUP(ROW(),$T$6:$W$25,4,0)),A136+1,VLOOKUP(ROW(),$T$6:$W$25,4,0)))","v":{"$error":"#VALUE!"}},"",{"$f":"INDEX(MID(SheetNames,FIND(\"]\",SheetNames)+1,255),ROWS(A$4:$A$4))","v":"Publicização"},"","","","","","","","","","","","",""]
[{"$f":"IF(INDIRECT(ADDRESS(ROW()-1,COLUMN()))+1>ROW(INDIRECT(\"'\"&INDEX(MID(SheetNames,FIND(\"]\",SheetNames)+1,255),ROWS(A$4:$A$4))&\"'!\"&\"ProjectLastRow\"))-1,\"\",IF(ISERROR(VLOOKUP(ROW(),$T$6:$W$25,4,0)),A137+1,VLOOKUP(ROW(),$T$6:$W$25,4,0)))","v":{"$error":"#VALUE!"}},"",{"$f":"INDEX(MID(SheetNames,FIND(\"]\",SheetNames)+1,255),ROWS(A$4:$A$4))","v":"Publicização"},"","","","","","","","","","","","",""]
[{"$f":"IF(INDIRECT(ADDRESS(ROW()-1,COLUMN()))+1>ROW(INDIRECT(\"'\"&INDEX(MID(SheetNames,FIND(\"]\",SheetNames)+1,255),ROWS(A$4:$A$4))&\"'!\"&\"ProjectLastRow\"))-1,\"\",IF(ISERROR(VLOOKUP(ROW(),$T$6:$W$25,4,0)),A138+1,VLOOKUP(ROW(),$T$6:$W$25,4,0)))","v":{"$error":"#VALUE!"}},"",{"$f":"INDEX(MID(SheetNames,FIND(\"]\",SheetNames)+1,255),ROWS(A$4:$A$4))","v":"Publicização"},"","","","","","","","","","","","",""]
[{"$f":"IF(INDIRECT(ADDRESS(ROW()-1,COLUMN()))+1>ROW(INDIRECT(\"'\"&INDEX(MID(SheetNames,FIND(\"]\",SheetNames)+1,255),ROWS(A$4:$A$4))&\"'!\"&\"ProjectLastRow\"))-1,\"\",IF(ISERROR(VLOOKUP(ROW(),$T$6:$W$25,4,0)),A139+1,VLOOKUP(ROW(),$T$6:$W$25,4,0)))","v":{"$error":"#VALUE!"}},"",{"$f":"INDEX(MID(SheetNames,FIND(\"]\",SheetNames)+1,255),ROWS(A$4:$A$4))","v":"Publicização"},"","","","","","","","","","","","",""]
[{"$f":"IF(INDIRECT(ADDRESS(ROW()-1,COLUMN()))+1>ROW(INDIRECT(\"'\"&INDEX(MID(SheetNames,FIND(\"]\",SheetNames)+1,255),ROWS(A$4:$A$4))&\"'!\"&\"ProjectLastRow\"))-1,\"\",IF(ISERROR(VLOOKUP(ROW(),$T$6:$W$25,4,0)),A140+1,VLOOKUP(ROW(),$T$6:$W$25,4,0)))","v":{"$error":"#VALUE!"}},"",{"$f":"INDEX(MID(SheetNames,FIND(\"]\",SheetNames)+1,255),ROWS(A$4:$A$4))","v":"Publicização"},"","","","","","","","","","","","",""]
[{"$f":"IF(INDIRECT(ADDRESS(ROW()-1,COLUMN()))+1>ROW(INDIRECT(\"'\"&INDEX(MID(SheetNames,FIND(\"]\",SheetNames)+1,255),ROWS(A$4:$A$4))&\"'!\"&\"ProjectLastRow\"))-1,\"\",IF(ISERROR(VLOOKUP(ROW(),$T$6:$W$25,4,0)),A141+1,VLOOKUP(ROW(),$T$6:$W$25,4,0)))","v":{"$error":"#VALUE!"}},"",{"$f":"INDEX(MID(SheetNames,FIND(\"]\",SheetNames)+1,255),ROWS(A$4:$A$4))","v":"Publicização"},"","","","","","","","","","","","",""]
[{"$f":"IF(INDIRECT(ADDRESS(ROW()-1,COLUMN()))+1>ROW(INDIRECT(\"'\"&INDEX(MID(SheetNames,FIND(\"]\",SheetNames)+1,255),ROWS(A$4:$A$4))&\"'!\"&\"ProjectLastRow\"))-1,\"\",IF(ISERROR(VLOOKUP(ROW(),$T$6:$W$25,4,0)),A142+1,VLOOKUP(ROW(),$T$6:$W$25,4,0)))","v":{"$error":"#VALUE!"}},"",{"$f":"INDEX(MID(SheetNames,FIND(\"]\",SheetNames)+1,255),ROWS(A$4:$A$4))","v":"Publicização"},"","","","","","","","","","","","",""]
[{"$f":"IF(INDIRECT(ADDRESS(ROW()-1,COLUMN()))+1>ROW(INDIRECT(\"'\"&INDEX(MID(SheetNames,FIND(\"]\",SheetNames)+1,255),ROWS(A$4:$A$4))&\"'!\"&\"ProjectLastRow\"))-1,\"\",IF(ISERROR(VLOOKUP(ROW(),$T$6:$W$25,4,0)),A143+1,VLOOKUP(ROW(),$T$6:$W$25,4,0)))","v":{"$error":"#VALUE!"}},"",{"$f":"INDEX(MID(SheetNames,FIND(\"]\",SheetNames)+1,255),ROWS(A$4:$A$4))","v":"Publicização"},"","","","","","","","","","","","",""]
[{"$f":"IF(INDIRECT(ADDRESS(ROW()-1,COLUMN()))+1>ROW(INDIRECT(\"'\"&INDEX(MID(SheetNames,FIND(\"]\",SheetNames)+1,255),ROWS(A$4:$A$4))&\"'!\"&\"ProjectLastRow\"))-1,\"\",IF(ISERROR(VLOOKUP(ROW(),$T$6:$W$25,4,0)),A144+1,VLOOKUP(ROW(),$T$6:$W$25,4,0)))","v":{"$error":"#VALUE!"}},"",{"$f":"INDEX(MID(SheetNames,FIND(\"]\",SheetNames)+1,255),ROWS(A$4:$A$4))","v":"Publicização"},"","","","","","","","","","","","",""]
[{"$f":"IF(INDIRECT(ADDRESS(ROW()-1,COLUMN()))+1>ROW(INDIRECT(\"'\"&INDEX(MID(SheetNames,FIND(\"]\",SheetNames)+1,255),ROWS(A$4:$A$4))&\"'!\"&\"ProjectLastRow\"))-1,\"\",IF(ISERROR(VLOOKUP(ROW(),$T$6:$W$25,4,0)),A145+1,VLOOKUP(ROW(),$T$6:$W$25,4,0)))","v":{"$error":"#VALUE!"}},"",{"$f":"INDEX(MID(SheetNames,FIND(\"]\",SheetNames)+1,255),ROWS(A$4:$A$4))","v":"Publicização"},"","","","","","","","","","","","",""]
[{"$f":"IF(INDIRECT(ADDRESS(ROW()-1,COLUMN()))+1>ROW(INDIRECT(\"'\"&INDEX(MID(SheetNames,FIND(\"]\",SheetNames)+1,255),ROWS(A$4:$A$4))&\"'!\"&\"ProjectLastRow\"))-1,\"\",IF(ISERROR(VLOOKUP(ROW(),$T$6:$W$25,4,0)),A146+1,VLOOKUP(ROW(),$T$6:$W$25,4,0)))","v":{"$error":"#VALUE!"}},"",{"$f":"INDEX(MID(SheetNames,FIND(\"]\",SheetNames)+1,255),ROWS(A$4:$A$4))","v":"Publicização"},"","","","","","","","","","","","",""]
[{"$f":"IF(INDIRECT(ADDRESS(ROW()-1,COLUMN()))+1>ROW(INDIRECT(\"'\"&INDEX(MID(SheetNames,FIND(\"]\",SheetNames)+1,255),ROWS(A$4:$A$4))&\"'!\"&\"ProjectLastRow\"))-1,\"\",IF(ISERROR(VLOOKUP(ROW(),$T$6:$W$25,4,0)),A147+1,VLOOKUP(ROW(),$T$6:$W$25,4,0)))","v":{"$error":"#VALUE!"}},"",{"$f":"INDEX(MID(SheetNames,FIND(\"]\",SheetNames)+1,255),ROWS(A$4:$A$4))","v":"Publicização"},"","","","","","","","","","","","",""]
[{"$f":"IF(INDIRECT(ADDRESS(ROW()-1,COLUMN()))+1>ROW(INDIRECT(\"'\"&INDEX(MID(SheetNames,FIND(\"]\",SheetNames)+1,255),ROWS(A$4:$A$4))&\"'!\"&\"ProjectLastRow\"))-1,\"\",IF(ISERROR(VLOOKUP(ROW(),$T$6:$W$25,4,0)),A148+1,VLOOKUP(ROW(),$T$6:$W$25,4,0)))","v":{"$error":"#VALUE!"}},"",{"$f":"INDEX(MID(SheetNames,FIND(\"]\",SheetNames)+1,255),ROWS(A$4:$A$4))","v":"Publicização"},"","","","","","","","","","","","",""]
[{"$f":"IF(INDIRECT(ADDRESS(ROW()-1,COLUMN()))+1>ROW(INDIRECT(\"'\"&INDEX(MID(SheetNames,FIND(\"]\",SheetNames)+1,255),ROWS(A$4:$A$4))&\"'!\"&\"ProjectLastRow\"))-1,\"\",IF(ISERROR(VLOOKUP(ROW(),$T$6:$W$25,4,0)),A149+1,VLOOKUP(ROW(),$T$6:$W$25,4,0)))","v":{"$error":"#VALUE!"}},"",{"$f":"INDEX(MID(SheetNames,FIND(\"]\",SheetNames)+1,255),ROWS(A$4:$A$4))","v":"Publicização"},"","","","","","","","","","","","",""]
[{"$f":"IF(INDIRECT(ADDRESS(ROW()-1,COLUMN()))+1>ROW(INDIRECT(\"'\"&INDEX(MID(SheetNames,FIND(\"]\",SheetNames)+1,255),ROWS(A$4:$A$4))&\"'!\"&\"ProjectLastRow\"))-1,\"\",IF(ISERROR(VLOOKUP(ROW(),$T$6:$W$25,4,0)),A150+1,VLOOKUP(ROW(),$T$6:$W$25,4,0)))","v":{"$error":"#VALUE!"}},"",{"$f":"INDEX(MID(SheetNames,FIND(\"]\",SheetNames)+1,255),ROWS(A$4:$A$4))","v":"Publicização"},{"$f":"IF(OR(ISBLANK(INDIRECT(\"'\"&$C151&\"'!\"&D$4&$A151)),ISERROR(INDIRECT(\"'\"&$C151&\"'!\"&D$4&$A151))),\"\",INDIRECT(\"'\"&$C151&\"'!\"&D$4&$A151))","v":""},"","","","","","","","","","","",""]
[{"$f":"IF(INDIRECT(ADDRESS(ROW()-1,COLUMN()))+1>ROW(INDIRECT(\"'\"&INDEX(MID(SheetNames,FIND(\"]\",SheetNames)+1,255),ROWS(A$4:$A$4))&\"'!\"&\"ProjectLastRow\"))-1,\"\",IF(ISERROR(VLOOKUP(ROW(),$T$6:$W$25,4,0)),A151+1,VLOOKUP(ROW(),$T$6:$W$25,4,0)))","v":{"$error":"#VALUE!"}},"",{"$f":"INDEX(MID(SheetNames,FIND(\"]\",SheetNames)+1,255),ROWS(A$4:$A$4))","v":"Publicização"},"","","","","","","","","","","","",""]
[{"$f":"IF(INDIRECT(ADDRESS(ROW()-1,COLUMN()))+1>ROW(INDIRECT(\"'\"&INDEX(MID(SheetNames,FIND(\"]\",SheetNames)+1,255),ROWS(A$4:$A$4))&\"'!\"&\"ProjectLastRow\"))-1,\"\",IF(ISERROR(VLOOKUP(ROW(),$T$6:$W$25,4,0)),A152+1,VLOOKUP(ROW(),$T$6:$W$25,4,0)))","v":{"$error":"#VALUE!"}},"",{"$f":"INDEX(MID(SheetNames,FIND(\"]\",SheetNames)+1,255),ROWS(A$4:$A$4))","v":"Publicização"},"","","","","","","","","","","","",""]
[{"$f":"IF(INDIRECT(ADDRESS(ROW()-1,COLUMN()))+1>ROW(INDIRECT(\"'\"&INDEX(MID(SheetNames,FIND(\"]\",SheetNames)+1,255),ROWS(A$4:$A$4))&\"'!\"&\"ProjectLastRow\"))-1,\"\",IF(ISERROR(VLOOKUP(ROW(),$T$6:$W$25,4,0)),A153+1,VLOOKUP(ROW(),$T$6:$W$25,4,0)))","v":{"$error":"#VALUE!"}},"",{"$f":"INDEX(MID(SheetNames,FIND(\"]\",SheetNames)+1,255),ROWS(A$4:$A$4))","v":"Publicização"},"","","","","","","","","","","","",""]
[{"$f":"IF(INDIRECT(ADDRESS(ROW()-1,COLUMN()))+1>ROW(INDIRECT(\"'\"&INDEX(MID(SheetNames,FIND(\"]\",SheetNames)+1,255),ROWS(A$4:$A$4))&\"'!\"&\"ProjectLastRow\"))-1,\"\",IF(ISERROR(VLOOKUP(ROW(),$T$6:$W$25,4,0)),A154+1,VLOOKUP(ROW(),$T$6:$W$25,4,0)))","v":{"$error":"#VALUE!"}},"",{"$f":"INDEX(MID(SheetNames,FIND(\"]\",SheetNames)+1,255),ROWS(A$4:$A$4))","v":"Publicização"},"","","","","","","","","","","","",""]
[{"$f":"IF(INDIRECT(ADDRESS(ROW()-1,COLUMN()))+1>ROW(INDIRECT(\"'\"&INDEX(MID(SheetNames,FIND(\"]\",SheetNames)+1,255),ROWS(A$4:$A$4))&\"'!\"&\"ProjectLastRow\"))-1,\"\",IF(ISERROR(VLOOKUP(ROW(),$T$6:$W$25,4,0)),A155+1,VLOOKUP(ROW(),$T$6:$W$25,4,0)))","v":{"$error":"#VALUE!"}},"",{"$f":"INDEX(MID(SheetNames,FIND(\"]\",SheetNames)+1,255),ROWS(A$4:$A$4))","v":"Publicização"},"","","","","","","","","","","","",""]
[{"$f":"IF(INDIRECT(ADDRESS(ROW()-1,COLUMN()))+1>ROW(INDIRECT(\"'\"&INDEX(MID(SheetNames,FIND(\"]\",SheetNames)+1,255),ROWS(A$4:$A$4))&\"'!\"&\"ProjectLastRow\"))-1,\"\",IF(ISERROR(VLOOKUP(ROW(),$T$6:$W$25,4,0)),A156+1,VLOOKUP(ROW(),$T$6:$W$25,4,0)))","v":{"$error":"#VALUE!"}},"",{"$f":"INDEX(MID(SheetNames,FIND(\"]\",SheetNames)+1,255),ROWS(A$4:$A$4))","v":"Publicização"},"","","","","","","","","","","","",""]
[{"$f":"IF(INDIRECT(ADDRESS(ROW()-1,COLUMN()))+1>ROW(INDIRECT(\"'\"&INDEX(MID(SheetNames,FIND(\"]\",SheetNames)+1,255),ROWS(A$4:$A$4))&\"'!\"&\"ProjectLastRow\"))-1,\"\",IF(ISERROR(VLOOKUP(ROW(),$T$6:$W$25,4,0)),A157+1,VLOOKUP(ROW(),$T$6:$W$25,4,0)))","v":{"$error":"#VALUE!"}},"",{"$f":"INDEX(MID(SheetNames,FIND(\"]\",SheetNames)+1,255),ROWS(A$4:$A$4))","v":"Publicização"},"","","","","","","","","","","","",""]
[{"$f":"IF(INDIRECT(ADDRESS(ROW()-1,COLUMN()))+1>ROW(INDIRECT(\"'\"&INDEX(MID(SheetNames,FIND(\"]\",SheetNames)+1,255),ROWS(A$4:$A$4))&\"'!\"&\"ProjectLastRow\"))-1,\"\",IF(ISERROR(VLOOKUP(ROW(),$T$6:$W$25,4,0)),A158+1,VLOOKUP(ROW(),$T$6:$W$25,4,0)))","v":{"$error":"#VALUE!"}},"",{"$f":"INDEX(MID(SheetNames,FIND(\"]\",SheetNames)+1,255),ROWS(A$4:$A$4))","v":"Publicização"},"","","","","","","","","","","","",""]
[{"$f":"IF(INDIRECT(ADDRESS(ROW()-1,COLUMN()))+1>ROW(INDIRECT(\"'\"&INDEX(MID(SheetNames,FIND(\"]\",SheetNames)+1,255),ROWS(A$4:$A$4))&\"'!\"&\"ProjectLastRow\"))-1,\"\",IF(ISERROR(VLOOKUP(ROW(),$T$6:$W$25,4,0)),A159+1,VLOOKUP(ROW(),$T$6:$W$25,4,0)))","v":{"$error":"#VALUE!"}},"",{"$f":"INDEX(MID(SheetNames,FIND(\"]\",SheetNames)+1,255),ROWS(A$4:$A$4))","v":"Publicização"},"","","","","","","","","","","","",""]
[{"$f":"IF(INDIRECT(ADDRESS(ROW()-1,COLUMN()))+1>ROW(INDIRECT(\"'\"&INDEX(MID(SheetNames,FIND(\"]\",SheetNames)+1,255),ROWS(A$4:$A$4))&\"'!\"&\"ProjectLastRow\"))-1,\"\",IF(ISERROR(VLOOKUP(ROW(),$T$6:$W$25,4,0)),A160+1,VLOOKUP(ROW(),$T$6:$W$25,4,0)))","v":{"$error":"#VALUE!"}},"",{"$f":"INDEX(MID(SheetNames,FIND(\"]\",SheetNames)+1,255),ROWS(A$4:$A$4))","v":"Publicização"},"","","","","","","","","","","","",""]
[{"$f":"IF(INDIRECT(ADDRESS(ROW()-1,COLUMN()))+1>ROW(INDIRECT(\"'\"&INDEX(MID(SheetNames,FIND(\"]\",SheetNames)+1,255),ROWS(A$4:$A$4))&\"'!\"&\"ProjectLastRow\"))-1,\"\",IF(ISERROR(VLOOKUP(ROW(),$T$6:$W$25,4,0)),A161+1,VLOOKUP(ROW(),$T$6:$W$25,4,0)))","v":{"$error":"#VALUE!"}},"",{"$f":"INDEX(MID(SheetNames,FIND(\"]\",SheetNames)+1,255),ROWS(A$4:$A$4))","v":"Publicização"},"","","","","","","","","","","","",""]
[{"$f":"IF(INDIRECT(ADDRESS(ROW()-1,COLUMN()))+1>ROW(INDIRECT(\"'\"&INDEX(MID(SheetNames,FIND(\"]\",SheetNames)+1,255),ROWS(A$4:$A$4))&\"'!\"&\"ProjectLastRow\"))-1,\"\",IF(ISERROR(VLOOKUP(ROW(),$T$6:$W$25,4,0)),A162+1,VLOOKUP(ROW(),$T$6:$W$25,4,0)))","v":{"$error":"#VALUE!"}},"",{"$f":"INDEX(MID(SheetNames,FIND(\"]\",SheetNames)+1,255),ROWS(A$4:$A$4))","v":"Publicização"},"","","","","","","","","","","","",""]
[{"$f":"IF(INDIRECT(ADDRESS(ROW()-1,COLUMN()))+1>ROW(INDIRECT(\"'\"&INDEX(MID(SheetNames,FIND(\"]\",SheetNames)+1,255),ROWS(A$4:$A$4))&\"'!\"&\"ProjectLastRow\"))-1,\"\",IF(ISERROR(VLOOKUP(ROW(),$T$6:$W$25,4,0)),A163+1,VLOOKUP(ROW(),$T$6:$W$25,4,0)))","v":{"$error":"#VALUE!"}},"",{"$f":"INDEX(MID(SheetNames,FIND(\"]\",SheetNames)+1,255),ROWS(A$4:$A$4))","v":"Publicização"},"","","","","","","","","","","","",""]
[{"$f":"IF(INDIRECT(ADDRESS(ROW()-1,COLUMN()))+1>ROW(INDIRECT(\"'\"&INDEX(MID(SheetNames,FIND(\"]\",SheetNames)+1,255),ROWS(A$4:$A$4))&\"'!\"&\"ProjectLastRow\"))-1,\"\",IF(ISERROR(VLOOKUP(ROW(),$T$6:$W$25,4,0)),A164+1,VLOOKUP(ROW(),$T$6:$W$25,4,0)))","v":{"$error":"#VALUE!"}},"",{"$f":"INDEX(MID(SheetNames,FIND(\"]\",SheetNames)+1,255),ROWS(A$4:$A$4))","v":"Publicização"},"","","","","","","","","","","","",""]
[{"$f":"IF(INDIRECT(ADDRESS(ROW()-1,COLUMN()))+1>ROW(INDIRECT(\"'\"&INDEX(MID(SheetNames,FIND(\"]\",SheetNames)+1,255),ROWS(A$4:$A$4))&\"'!\"&\"ProjectLastRow\"))-1,\"\",IF(ISERROR(VLOOKUP(ROW(),$T$6:$W$25,4,0)),A165+1,VLOOKUP(ROW(),$T$6:$W$25,4,0)))","v":{"$error":"#VALUE!"}},"",{"$f":"INDEX(MID(SheetNames,FIND(\"]\",SheetNames)+1,255),ROWS(A$4:$A$4))","v":"Publicização"},"","","","","","","","","","","","",""]
[{"$f":"IF(INDIRECT(ADDRESS(ROW()-1,COLUMN()))+1>ROW(INDIRECT(\"'\"&INDEX(MID(SheetNames,FIND(\"]\",SheetNames)+1,255),ROWS(A$4:$A$4))&\"'!\"&\"ProjectLastRow\"))-1,\"\",IF(ISERROR(VLOOKUP(ROW(),$T$6:$W$25,4,0)),A166+1,VLOOKUP(ROW(),$T$6:$W$25,4,0)))","v":{"$error":"#VALUE!"}},"",{"$f":"INDEX(MID(SheetNames,FIND(\"]\",SheetNames)+1,255),ROWS(A$4:$A$4))","v":"Publicização"},{"$f":"IF(OR(ISBLANK(INDIRECT(\"'\"&$C167&\"'!\"&D$4&$A167)),ISERROR(INDIRECT(\"'\"&$C167&\"'!\"&D$4&$A167))),\"\",INDIRECT(\"'\"&$C167&\"'!\"&D$4&$A167))","v":""},"","","","","","","","","","","",""]
[{"$f":"IF(INDIRECT(ADDRESS(ROW()-1,COLUMN()))+1>ROW(INDIRECT(\"'\"&INDEX(MID(SheetNames,FIND(\"]\",SheetNames)+1,255),ROWS(A$4:$A$4))&\"'!\"&\"ProjectLastRow\"))-1,\"\",IF(ISERROR(VLOOKUP(ROW(),$T$6:$W$25,4,0)),A167+1,VLOOKUP(ROW(),$T$6:$W$25,4,0)))","v":{"$error":"#VALUE!"}},"",{"$f":"INDEX(MID(SheetNames,FIND(\"]\",SheetNames)+1,255),ROWS(A$4:$A$4))","v":"Publicização"},"","","","","","","","","","","","",""]
[{"$f":"IF(INDIRECT(ADDRESS(ROW()-1,COLUMN()))+1>ROW(INDIRECT(\"'\"&INDEX(MID(SheetNames,FIND(\"]\",SheetNames)+1,255),ROWS(A$4:$A$4))&\"'!\"&\"ProjectLastRow\"))-1,\"\",IF(ISERROR(VLOOKUP(ROW(),$T$6:$W$25,4,0)),A168+1,VLOOKUP(ROW(),$T$6:$W$25,4,0)))","v":{"$error":"#VALUE!"}},"",{"$f":"INDEX(MID(SheetNames,FIND(\"]\",SheetNames)+1,255),ROWS(A$4:$A$4))","v":"Publicização"},"","","","","","","","","","","","",""]
[{"$f":"IF(INDIRECT(ADDRESS(ROW()-1,COLUMN()))+1>ROW(INDIRECT(\"'\"&INDEX(MID(SheetNames,FIND(\"]\",SheetNames)+1,255),ROWS(A$4:$A$4))&\"'!\"&\"ProjectLastRow\"))-1,\"\",IF(ISERROR(VLOOKUP(ROW(),$T$6:$W$25,4,0)),A169+1,VLOOKUP(ROW(),$T$6:$W$25,4,0)))","v":{"$error":"#VALUE!"}},"",{"$f":"INDEX(MID(SheetNames,FIND(\"]\",SheetNames)+1,255),ROWS(A$4:$A$4))","v":"Publicização"},"","","","","","","","","","","","",""]
[{"$f":"IF(INDIRECT(ADDRESS(ROW()-1,COLUMN()))+1>ROW(INDIRECT(\"'\"&INDEX(MID(SheetNames,FIND(\"]\",SheetNames)+1,255),ROWS(A$4:$A$4))&\"'!\"&\"ProjectLastRow\"))-1,\"\",IF(ISERROR(VLOOKUP(ROW(),$T$6:$W$25,4,0)),A170+1,VLOOKUP(ROW(),$T$6:$W$25,4,0)))","v":{"$error":"#VALUE!"}},"",{"$f":"INDEX(MID(SheetNames,FIND(\"]\",SheetNames)+1,255),ROWS(A$4:$A$4))","v":"Publicização"},"","","","","","","","","","","","",""]
[{"$f":"IF(INDIRECT(ADDRESS(ROW()-1,COLUMN()))+1>ROW(INDIRECT(\"'\"&INDEX(MID(SheetNames,FIND(\"]\",SheetNames)+1,255),ROWS(A$4:$A$4))&\"'!\"&\"ProjectLastRow\"))-1,\"\",IF(ISERROR(VLOOKUP(ROW(),$T$6:$W$25,4,0)),A171+1,VLOOKUP(ROW(),$T$6:$W$25,4,0)))","v":{"$error":"#VALUE!"}},"",{"$f":"INDEX(MID(SheetNames,FIND(\"]\",SheetNames)+1,255),ROWS(A$4:$A$4))","v":"Publicização"},"","","","","","","","","","","","",""]
[{"$f":"IF(INDIRECT(ADDRESS(ROW()-1,COLUMN()))+1>ROW(INDIRECT(\"'\"&INDEX(MID(SheetNames,FIND(\"]\",SheetNames)+1,255),ROWS(A$4:$A$4))&\"'!\"&\"ProjectLastRow\"))-1,\"\",IF(ISERROR(VLOOKUP(ROW(),$T$6:$W$25,4,0)),A172+1,VLOOKUP(ROW(),$T$6:$W$25,4,0)))","v":{"$error":"#VALUE!"}},"",{"$f":"INDEX(MID(SheetNames,FIND(\"]\",SheetNames)+1,255),ROWS(A$4:$A$4))","v":"Publicização"},"","","","","","","","","","","","",""]
[{"$f":"IF(INDIRECT(ADDRESS(ROW()-1,COLUMN()))+1>ROW(INDIRECT(\"'\"&INDEX(MID(SheetNames,FIND(\"]\",SheetNames)+1,255),ROWS(A$4:$A$4))&\"'!\"&\"ProjectLastRow\"))-1,\"\",IF(ISERROR(VLOOKUP(ROW(),$T$6:$W$25,4,0)),A173+1,VLOOKUP(ROW(),$T$6:$W$25,4,0)))","v":{"$error":"#VALUE!"}},"",{"$f":"INDEX(MID(SheetNames,FIND(\"]\",SheetNames)+1,255),ROWS(A$4:$A$4))","v":"Publicização"},"","","","","","","","","","","","",""]
[{"$f":"IF(INDIRECT(ADDRESS(ROW()-1,COLUMN()))+1>ROW(INDIRECT(\"'\"&INDEX(MID(SheetNames,FIND(\"]\",SheetNames)+1,255),ROWS(A$4:$A$4))&\"'!\"&\"ProjectLastRow\"))-1,\"\",IF(ISERROR(VLOOKUP(ROW(),$T$6:$W$25,4,0)),A174+1,VLOOKUP(ROW(),$T$6:$W$25,4,0)))","v":{"$error":"#VALUE!"}},"",{"$f":"INDEX(MID(SheetNames,FIND(\"]\",SheetNames)+1,255),ROWS(A$4:$A$4))","v":"Publicização"},"","","","","","","","","","","","",""]
[{"$f":"IF(INDIRECT(ADDRESS(ROW()-1,COLUMN()))+1>ROW(INDIRECT(\"'\"&INDEX(MID(SheetNames,FIND(\"]\",SheetNames)+1,255),ROWS(A$4:$A$4))&\"'!\"&\"ProjectLastRow\"))-1,\"\",IF(ISERROR(VLOOKUP(ROW(),$T$6:$W$25,4,0)),A175+1,VLOOKUP(ROW(),$T$6:$W$25,4,0)))","v":{"$error":"#VALUE!"}},"",{"$f":"INDEX(MID(SheetNames,FIND(\"]\",SheetNames)+1,255),ROWS(A$4:$A$4))","v":"Publicização"},"","","","","","","","","","","","",""]
[{"$f":"IF(INDIRECT(ADDRESS(ROW()-1,COLUMN()))+1>ROW(INDIRECT(\"'\"&INDEX(MID(SheetNames,FIND(\"]\",SheetNames)+1,255),ROWS(A$4:$A$4))&\"'!\"&\"ProjectLastRow\"))-1,\"\",IF(ISERROR(VLOOKUP(ROW(),$T$6:$W$25,4,0)),A176+1,VLOOKUP(ROW(),$T$6:$W$25,4,0)))","v":{"$error":"#VALUE!"}},"",{"$f":"INDEX(MID(SheetNames,FIND(\"]\",SheetNames)+1,255),ROWS(A$4:$A$4))","v":"Publicização"},"","","","","","","","","","","","",""]
[{"$f":"IF(INDIRECT(ADDRESS(ROW()-1,COLUMN()))+1>ROW(INDIRECT(\"'\"&INDEX(MID(SheetNames,FIND(\"]\",SheetNames)+1,255),ROWS(A$4:$A$4))&\"'!\"&\"ProjectLastRow\"))-1,\"\",IF(ISERROR(VLOOKUP(ROW(),$T$6:$W$25,4,0)),A177+1,VLOOKUP(ROW(),$T$6:$W$25,4,0)))","v":{"$error":"#VALUE!"}},"",{"$f":"INDEX(MID(SheetNames,FIND(\"]\",SheetNames)+1,255),ROWS(A$4:$A$4))","v":"Publicização"},"","","","","","","","","","","","",""]
[{"$f":"IF(INDIRECT(ADDRESS(ROW()-1,COLUMN()))+1>ROW(INDIRECT(\"'\"&INDEX(MID(SheetNames,FIND(\"]\",SheetNames)+1,255),ROWS(A$4:$A$4))&\"'!\"&\"ProjectLastRow\"))-1,\"\",IF(ISERROR(VLOOKUP(ROW(),$T$6:$W$25,4,0)),A178+1,VLOOKUP(ROW(),$T$6:$W$25,4,0)))","v":{"$error":"#VALUE!"}},"",{"$f":"INDEX(MID(SheetNames,FIND(\"]\",SheetNames)+1,255),ROWS(A$4:$A$4))","v":"Publicização"},"","","","","","","","","","","","",""]
[{"$f":"IF(INDIRECT(ADDRESS(ROW()-1,COLUMN()))+1>ROW(INDIRECT(\"'\"&INDEX(MID(SheetNames,FIND(\"]\",SheetNames)+1,255),ROWS(A$4:$A$4))&\"'!\"&\"ProjectLastRow\"))-1,\"\",IF(ISERROR(VLOOKUP(ROW(),$T$6:$W$25,4,0)),A179+1,VLOOKUP(ROW(),$T$6:$W$25,4,0)))","v":{"$error":"#VALUE!"}},"",{"$f":"INDEX(MID(SheetNames,FIND(\"]\",SheetNames)+1,255),ROWS(A$4:$A$4))","v":"Publicização"},"","","","","","","","","","","","",""]
[{"$f":"IF(INDIRECT(ADDRESS(ROW()-1,COLUMN()))+1>ROW(INDIRECT(\"'\"&INDEX(MID(SheetNames,FIND(\"]\",SheetNames)+1,255),ROWS(A$4:$A$4))&\"'!\"&\"ProjectLastRow\"))-1,\"\",IF(ISERROR(VLOOKUP(ROW(),$T$6:$W$25,4,0)),A180+1,VLOOKUP(ROW(),$T$6:$W$25,4,0)))","v":{"$error":"#VALUE!"}},"",{"$f":"INDEX(MID(SheetNames,FIND(\"]\",SheetNames)+1,255),ROWS(A$4:$A$4))","v":"Publicização"},"","","","","","","","","","","","",""]
[{"$f":"IF(INDIRECT(ADDRESS(ROW()-1,COLUMN()))+1>ROW(INDIRECT(\"'\"&INDEX(MID(SheetNames,FIND(\"]\",SheetNames)+1,255),ROWS(A$4:$A$4))&\"'!\"&\"ProjectLastRow\"))-1,\"\",IF(ISERROR(VLOOKUP(ROW(),$T$6:$W$25,4,0)),A181+1,VLOOKUP(ROW(),$T$6:$W$25,4,0)))","v":{"$error":"#VALUE!"}},"",{"$f":"INDEX(MID(SheetNames,FIND(\"]\",SheetNames)+1,255),ROWS(A$4:$A$4))","v":"Publicização"},"","","","","","","","","","","","",""]
[{"$f":"IF(INDIRECT(ADDRESS(ROW()-1,COLUMN()))+1>ROW(INDIRECT(\"'\"&INDEX(MID(SheetNames,FIND(\"]\",SheetNames)+1,255),ROWS(A$4:$A$4))&\"'!\"&\"ProjectLastRow\"))-1,\"\",IF(ISERROR(VLOOKUP(ROW(),$T$6:$W$25,4,0)),A182+1,VLOOKUP(ROW(),$T$6:$W$25,4,0)))","v":{"$error":"#VALUE!"}},"",{"$f":"INDEX(MID(SheetNames,FIND(\"]\",SheetNames)+1,255),ROWS(A$4:$A$4))","v":"Publicização"},{"$f":"IF(OR(ISBLANK(INDIRECT(\"'\"&$C183&\"'!\"&D$4&$A183)),ISERROR(INDIRECT(\"'\"&$C183&\"'!\"&D$4&$A183))),\"\",INDIRECT(\"'\"&$C183&\"'!\"&D$4&$A183))","v":""},"","","","","","","","","","","",""]
[{"$f":"IF(INDIRECT(ADDRESS(ROW()-1,COLUMN()))+1>ROW(INDIRECT(\"'\"&INDEX(MID(SheetNames,FIND(\"]\",SheetNames)+1,255),ROWS(A$4:$A$4))&\"'!\"&\"ProjectLastRow\"))-1,\"\",IF(ISERROR(VLOOKUP(ROW(),$T$6:$W$25,4,0)),A183+1,VLOOKUP(ROW(),$T$6:$W$25,4,0)))","v":{"$error":"#VALUE!"}},"",{"$f":"INDEX(MID(SheetNames,FIND(\"]\",SheetNames)+1,255),ROWS(A$4:$A$4))","v":"Publicização"},"","","","","","","","","","","","",""]
[{"$f":"IF(INDIRECT(ADDRESS(ROW()-1,COLUMN()))+1>ROW(INDIRECT(\"'\"&INDEX(MID(SheetNames,FIND(\"]\",SheetNames)+1,255),ROWS(A$4:$A$4))&\"'!\"&\"ProjectLastRow\"))-1,\"\",IF(ISERROR(VLOOKUP(ROW(),$T$6:$W$25,4,0)),A184+1,VLOOKUP(ROW(),$T$6:$W$25,4,0)))","v":{"$error":"#VALUE!"}},"",{"$f":"INDEX(MID(SheetNames,FIND(\"]\",SheetNames)+1,255),ROWS(A$4:$A$4))","v":"Publicização"},"","","","","","","","","","","","",""]
[{"$f":"IF(INDIRECT(ADDRESS(ROW()-1,COLUMN()))+1>ROW(INDIRECT(\"'\"&INDEX(MID(SheetNames,FIND(\"]\",SheetNames)+1,255),ROWS(A$4:$A$4))&\"'!\"&\"ProjectLastRow\"))-1,\"\",IF(ISERROR(VLOOKUP(ROW(),$T$6:$W$25,4,0)),A185+1,VLOOKUP(ROW(),$T$6:$W$25,4,0)))","v":{"$error":"#VALUE!"}},"",{"$f":"INDEX(MID(SheetNames,FIND(\"]\",SheetNames)+1,255),ROWS(A$4:$A$4))","v":"Publicização"},"","","","","","","","","","","","",""]
[{"$f":"IF(INDIRECT(ADDRESS(ROW()-1,COLUMN()))+1>ROW(INDIRECT(\"'\"&INDEX(MID(SheetNames,FIND(\"]\",SheetNames)+1,255),ROWS(A$4:$A$4))&\"'!\"&\"ProjectLastRow\"))-1,\"\",IF(ISERROR(VLOOKUP(ROW(),$T$6:$W$25,4,0)),A186+1,VLOOKUP(ROW(),$T$6:$W$25,4,0)))","v":{"$error":"#VALUE!"}},"",{"$f":"INDEX(MID(SheetNames,FIND(\"]\",SheetNames)+1,255),ROWS(A$4:$A$4))","v":"Publicização"},"","","","","","","","","","","","",""]
[{"$f":"IF(INDIRECT(ADDRESS(ROW()-1,COLUMN()))+1>ROW(INDIRECT(\"'\"&INDEX(MID(SheetNames,FIND(\"]\",SheetNames)+1,255),ROWS(A$4:$A$4))&\"'!\"&\"ProjectLastRow\"))-1,\"\",IF(ISERROR(VLOOKUP(ROW(),$T$6:$W$25,4,0)),A187+1,VLOOKUP(ROW(),$T$6:$W$25,4,0)))","v":{"$error":"#VALUE!"}},"",{"$f":"INDEX(MID(SheetNames,FIND(\"]\",SheetNames)+1,255),ROWS(A$4:$A$4))","v":"Publicização"},"","","","","","","","","","","","",""]
[{"$f":"IF(INDIRECT(ADDRESS(ROW()-1,COLUMN()))+1>ROW(INDIRECT(\"'\"&INDEX(MID(SheetNames,FIND(\"]\",SheetNames)+1,255),ROWS(A$4:$A$4))&\"'!\"&\"ProjectLastRow\"))-1,\"\",IF(ISERROR(VLOOKUP(ROW(),$T$6:$W$25,4,0)),A188+1,VLOOKUP(ROW(),$T$6:$W$25,4,0)))","v":{"$error":"#VALUE!"}},"",{"$f":"INDEX(MID(SheetNames,FIND(\"]\",SheetNames)+1,255),ROWS(A$4:$A$4))","v":"Publicização"},"","","","","","","","","","","","",""]
[{"$f":"IF(INDIRECT(ADDRESS(ROW()-1,COLUMN()))+1>ROW(INDIRECT(\"'\"&INDEX(MID(SheetNames,FIND(\"]\",SheetNames)+1,255),ROWS(A$4:$A$4))&\"'!\"&\"ProjectLastRow\"))-1,\"\",IF(ISERROR(VLOOKUP(ROW(),$T$6:$W$25,4,0)),A189+1,VLOOKUP(ROW(),$T$6:$W$25,4,0)))","v":{"$error":"#VALUE!"}},"",{"$f":"INDEX(MID(SheetNames,FIND(\"]\",SheetNames)+1,255),ROWS(A$4:$A$4))","v":"Publicização"},"","","","","","","","","","","","",""]
[{"$f":"IF(INDIRECT(ADDRESS(ROW()-1,COLUMN()))+1>ROW(INDIRECT(\"'\"&INDEX(MID(SheetNames,FIND(\"]\",SheetNames)+1,255),ROWS(A$4:$A$4))&\"'!\"&\"ProjectLastRow\"))-1,\"\",IF(ISERROR(VLOOKUP(ROW(),$T$6:$W$25,4,0)),A190+1,VLOOKUP(ROW(),$T$6:$W$25,4,0)))","v":{"$error":"#VALUE!"}},"",{"$f":"INDEX(MID(SheetNames,FIND(\"]\",SheetNames)+1,255),ROWS(A$4:$A$4))","v":"Publicização"},"","","","","","","","","","","","",""]
[{"$f":"IF(INDIRECT(ADDRESS(ROW()-1,COLUMN()))+1>ROW(INDIRECT(\"'\"&INDEX(MID(SheetNames,FIND(\"]\",SheetNames)+1,255),ROWS(A$4:$A$4))&\"'!\"&\"ProjectLastRow\"))-1,\"\",IF(ISERROR(VLOOKUP(ROW(),$T$6:$W$25,4,0)),A191+1,VLOOKUP(ROW(),$T$6:$W$25,4,0)))","v":{"$error":"#VALUE!"}},"",{"$f":"INDEX(MID(SheetNames,FIND(\"]\",SheetNames)+1,255),ROWS(A$4:$A$4))","v":"Publicização"},"","","","","","","","","","","","",""]
[{"$f":"IF(INDIRECT(ADDRESS(ROW()-1,COLUMN()))+1>ROW(INDIRECT(\"'\"&INDEX(MID(SheetNames,FIND(\"]\",SheetNames)+1,255),ROWS(A$4:$A$4))&\"'!\"&\"ProjectLastRow\"))-1,\"\",IF(ISERROR(VLOOKUP(ROW(),$T$6:$W$25,4,0)),A192+1,VLOOKUP(ROW(),$T$6:$W$25,4,0)))","v":{"$error":"#VALUE!"}},"",{"$f":"INDEX(MID(SheetNames,FIND(\"]\",SheetNames)+1,255),ROWS(A$4:$A$4))","v":"Publicização"},"","","","","","","","","","","","",""]
[{"$f":"IF(INDIRECT(ADDRESS(ROW()-1,COLUMN()))+1>ROW(INDIRECT(\"'\"&INDEX(MID(SheetNames,FIND(\"]\",SheetNames)+1,255),ROWS(A$4:$A$4))&\"'!\"&\"ProjectLastRow\"))-1,\"\",IF(ISERROR(VLOOKUP(ROW(),$T$6:$W$25,4,0)),A193+1,VLOOKUP(ROW(),$T$6:$W$25,4,0)))","v":{"$error":"#VALUE!"}},"",{"$f":"INDEX(MID(SheetNames,FIND(\"]\",SheetNames)+1,255),ROWS(A$4:$A$4))","v":"Publicização"},"","","","","","","","","","","","",""]
[{"$f":"IF(INDIRECT(ADDRESS(ROW()-1,COLUMN()))+1>ROW(INDIRECT(\"'\"&INDEX(MID(SheetNames,FIND(\"]\",SheetNames)+1,255),ROWS(A$4:$A$4))&\"'!\"&\"ProjectLastRow\"))-1,\"\",IF(ISERROR(VLOOKUP(ROW(),$T$6:$W$25,4,0)),A194+1,VLOOKUP(ROW(),$T$6:$W$25,4,0)))","v":{"$error":"#VALUE!"}},"",{"$f":"INDEX(MID(SheetNames,FIND(\"]\",SheetNames)+1,255),ROWS(A$4:$A$4))","v":"Publicização"},"","","","","","","","","","","","",""]
[{"$f":"IF(INDIRECT(ADDRESS(ROW()-1,COLUMN()))+1>ROW(INDIRECT(\"'\"&INDEX(MID(SheetNames,FIND(\"]\",SheetNames)+1,255),ROWS(A$4:$A$4))&\"'!\"&\"ProjectLastRow\"))-1,\"\",IF(ISERROR(VLOOKUP(ROW(),$T$6:$W$25,4,0)),A195+1,VLOOKUP(ROW(),$T$6:$W$25,4,0)))","v":{"$error":"#VALUE!"}},"",{"$f":"INDEX(MID(SheetNames,FIND(\"]\",SheetNames)+1,255),ROWS(A$4:$A$4))","v":"Publicização"},"","","","","","","","","","","","",""]
[{"$f":"IF(INDIRECT(ADDRESS(ROW()-1,COLUMN()))+1>ROW(INDIRECT(\"'\"&INDEX(MID(SheetNames,FIND(\"]\",SheetNames)+1,255),ROWS(A$4:$A$4))&\"'!\"&\"ProjectLastRow\"))-1,\"\",IF(ISERROR(VLOOKUP(ROW(),$T$6:$W$25,4,0)),A196+1,VLOOKUP(ROW(),$T$6:$W$25,4,0)))","v":{"$error":"#VALUE!"}},"",{"$f":"INDEX(MID(SheetNames,FIND(\"]\",SheetNames)+1,255),ROWS(A$4:$A$4))","v":"Publicização"},"","","","","","","","","","","","",""]
[{"$f":"IF(INDIRECT(ADDRESS(ROW()-1,COLUMN()))+1>ROW(INDIRECT(\"'\"&INDEX(MID(SheetNames,FIND(\"]\",SheetNames)+1,255),ROWS(A$4:$A$4))&\"'!\"&\"ProjectLastRow\"))-1,\"\",IF(ISERROR(VLOOKUP(ROW(),$T$6:$W$25,4,0)),A197+1,VLOOKUP(ROW(),$T$6:$W$25,4,0)))","v":{"$error":"#VALUE!"}},"",{"$f":"INDEX(MID(SheetNames,FIND(\"]\",SheetNames)+1,255),ROWS(A$4:$A$4))","v":"Publicização"},"","","","","","","","","","","","",""]
[{"$f":"IF(INDIRECT(ADDRESS(ROW()-1,COLUMN()))+1>ROW(INDIRECT(\"'\"&INDEX(MID(SheetNames,FIND(\"]\",SheetNames)+1,255),ROWS(A$4:$A$4))&\"'!\"&\"ProjectLastRow\"))-1,\"\",IF(ISERROR(VLOOKUP(ROW(),$T$6:$W$25,4,0)),A198+1,VLOOKUP(ROW(),$T$6:$W$25,4,0)))","v":{"$error":"#VALUE!"}},{"$f":"IF(D199=\"\",\"\",C199&\"_\"&E199)","v":""},{"$f":"INDEX(MID(SheetNames,FIND(\"]\",SheetNames)+1,255),ROWS(A$4:$A$4))","v":"Publicização"},{"$f":"IF(OR(ISBLANK(INDIRECT(\"'\"&$C199&\"'!\"&D$4&$A199)),ISERROR(INDIRECT(\"'\"&$C199&\"'!\"&D$4&$A199))),\"\",INDIRECT(\"'\"&$C199&\"'!\"&D$4&$A199))","v":""},"","","","","","","","","","","",""]
[{"$f":"IF(INDIRECT(ADDRESS(ROW()-1,COLUMN()))+1>ROW(INDIRECT(\"'\"&INDEX(MID(SheetNames,FIND(\"]\",SheetNames)+1,255),ROWS(A$4:$A$4))&\"'!\"&\"ProjectLastRow\"))-1,\"\",IF(ISERROR(VLOOKUP(ROW(),$T$6:$W$25,4,0)),A199+1,VLOOKUP(ROW(),$T$6:$W$25,4,0)))","v":{"$error":"#VALUE!"}},"",{"$f":"INDEX(MID(SheetNames,FIND(\"]\",SheetNames)+1,255),ROWS(A$4:$A$4))","v":"Publicização"},"","","","","","","","","","","","",""]
[{"$f":"IF(INDIRECT(ADDRESS(ROW()-1,COLUMN()))+1>ROW(INDIRECT(\"'\"&INDEX(MID(SheetNames,FIND(\"]\",SheetNames)+1,255),ROWS(A$4:$A$4))&\"'!\"&\"ProjectLastRow\"))-1,\"\",IF(ISERROR(VLOOKUP(ROW(),$T$6:$W$25,4,0)),A200+1,VLOOKUP(ROW(),$T$6:$W$25,4,0)))","v":{"$error":"#VALUE!"}},"",{"$f":"INDEX(MID(SheetNames,FIND(\"]\",SheetNames)+1,255),ROWS(A$4:$A$4))","v":"Publicização"},"","","","","","","","","","","","",""]
[{"$f":"IF(INDIRECT(ADDRESS(ROW()-1,COLUMN()))+1>ROW(INDIRECT(\"'\"&INDEX(MID(SheetNames,FIND(\"]\",SheetNames)+1,255),ROWS(A$4:$A$4))&\"'!\"&\"ProjectLastRow\"))-1,\"\",IF(ISERROR(VLOOKUP(ROW(),$T$6:$W$25,4,0)),A201+1,VLOOKUP(ROW(),$T$6:$W$25,4,0)))","v":{"$error":"#VALUE!"}},"",{"$f":"INDEX(MID(SheetNames,FIND(\"]\",SheetNames)+1,255),ROWS(A$4:$A$4))","v":"Publicização"},"","","","","","","","","","","","",""]
[{"$f":"IF(INDIRECT(ADDRESS(ROW()-1,COLUMN()))+1>ROW(INDIRECT(\"'\"&INDEX(MID(SheetNames,FIND(\"]\",SheetNames)+1,255),ROWS(A$4:$A$4))&\"'!\"&\"ProjectLastRow\"))-1,\"\",IF(ISERROR(VLOOKUP(ROW(),$T$6:$W$25,4,0)),A202+1,VLOOKUP(ROW(),$T$6:$W$25,4,0)))","v":{"$error":"#VALUE!"}},"",{"$f":"INDEX(MID(SheetNames,FIND(\"]\",SheetNames)+1,255),ROWS(A$4:$A$4))","v":"Publicização"},"","","","","","","","","","","","",""]